atom feed3 messages in org.apache.lucene.java-devRe: [JENKINS] Lucene-Solr-trunk-Linux...
FromSent OnAttachments
Policeman Jenkins ServerJul 12, 2015 3:22 pm 
Dawid WeissJul 13, 2015 2:59 am 
Uwe SchindlerJul 13, 2015 7:58 am 
Subject:Re: [JENKINS] Lucene-Solr-trunk-Linux (32bit/jdk1.9.0-ea-b71) - Build # 13435 - Failure!
From:Dawid Weiss (dawi@gmail.com)
Date:Jul 13, 2015 2:59:11 am
List:org.apache.lucene.java-dev

Nothing I'm aware of. There's a new build out too (b72): https://jdk9.java.net/download/

with several changes affecting the compiler, but nothing I could attribute to the failures we see: http://download.java.net/jdk9/changes/jdk9-b72.html?q=download/jdk9/changes/jdk9-b72.html

Dawid

On Mon, Jul 13, 2015 at 11:55 AM, Michael McCandless <luc@mikemccandless.com> wrote:

We are seeing a lot of these spooky failures on JDK 9 ea ... is this a known JDK9 issue already?

Mike McCandless

http://blog.mikemccandless.com

On Sun, Jul 12, 2015 at 6:22 PM, Policeman Jenkins Server <jenk@thetaphi.de> wrote:

Build: http://jenkins.thetaphi.de/job/Lucene-Solr-trunk-Linux/13435/ Java: 32bit/jdk1.9.0-ea-b71 -server -XX:+UseParallelGC
-Djava.locale.providers=JRE,SPI

186 tests failed. FAILED:
junit.framework.TestSuite.org.apache.lucene.search.payloads.TestPayloadTermQuery

Error Message: MockDirectoryWrapper: cannot close: there are still open files: {_5.fdt=1,
_0.cfs=1, _1.nvd=1, _2.cfs=1, _3.cfs=1, _4.cfs=1, _5.nvd=1, _1.fdt=1}

Stack Trace: java.lang.RuntimeException: MockDirectoryWrapper: cannot close: there are still
open files: {_5.fdt=1, _0.cfs=1, _1.nvd=1, _2.cfs=1, _3.cfs=1, _4.cfs=1,
_5.nvd=1, _1.fdt=1} at __randomizedtesting.SeedInfo.seed([721798422A6325A1]:0) at
org.apache.lucene.store.MockDirectoryWrapper.close(MockDirectoryWrapper.java:735) at
org.apache.lucene.search.payloads.TestPayloadTermQuery.afterClass(TestPayloadTermQuery.java:147) at sun.reflect.NativeMethodAccessorImpl.invoke0(Native Method) at
sun.reflect.NativeMethodAccessorImpl.invoke(NativeMethodAccessorImpl.java:62) at
sun.reflect.DelegatingMethodAccessorImpl.invoke(DelegatingMethodAccessorImpl.java:43) at java.lang.reflect.Method.invoke(Method.java:502) at
com.carrotsearch.randomizedtesting.RandomizedRunner.invoke(RandomizedRunner.java:1627) at
com.carrotsearch.randomizedtesting.RandomizedRunner$5.evaluate(RandomizedRunner.java:799) at
org.apache.lucene.util.AbstractBeforeAfterRule$1.evaluate(AbstractBeforeAfterRule.java:46) at
com.carrotsearch.randomizedtesting.rules.StatementAdapter.evaluate(StatementAdapter.java:36) at
org.apache.lucene.util.TestRuleStoreClassName$1.evaluate(TestRuleStoreClassName.java:42) at
com.carrotsearch.randomizedtesting.rules.NoShadowingOrOverridesOnMethodsRule$1.evaluate(NoShadowingOrOverridesOnMethodsRule.java:39) at
com.carrotsearch.randomizedtesting.rules.NoShadowingOrOverridesOnMethodsRule$1.evaluate(NoShadowingOrOverridesOnMethodsRule.java:39) at
com.carrotsearch.randomizedtesting.rules.StatementAdapter.evaluate(StatementAdapter.java:36) at
com.carrotsearch.randomizedtesting.rules.StatementAdapter.evaluate(StatementAdapter.java:36) at
com.carrotsearch.randomizedtesting.rules.StatementAdapter.evaluate(StatementAdapter.java:36) at
org.apache.lucene.util.TestRuleAssertionsRequired$1.evaluate(TestRuleAssertionsRequired.java:54) at
org.apache.lucene.util.TestRuleMarkFailure$1.evaluate(TestRuleMarkFailure.java:48) at
org.apache.lucene.util.TestRuleIgnoreAfterMaxFailures$1.evaluate(TestRuleIgnoreAfterMaxFailures.java:65) at
org.apache.lucene.util.TestRuleIgnoreTestSuites$1.evaluate(TestRuleIgnoreTestSuites.java:55) at
com.carrotsearch.randomizedtesting.rules.StatementAdapter.evaluate(StatementAdapter.java:36) at
com.carrotsearch.randomizedtesting.ThreadLeakControl$StatementRunner.run(ThreadLeakControl.java:365) at java.lang.Thread.run(Thread.java:745) Caused by: java.lang.RuntimeException: unclosed IndexInput: _1.nvd at
org.apache.lucene.store.MockDirectoryWrapper.addFileHandle(MockDirectoryWrapper.java:623) at
org.apache.lucene.store.MockDirectoryWrapper.openInput(MockDirectoryWrapper.java:667) at
org.apache.lucene.codecs.lucene53.Lucene53NormsProducer.<init>(Lucene53NormsProducer.java:68) at
org.apache.lucene.codecs.lucene53.Lucene53NormsFormat.normsProducer(Lucene53NormsFormat.java:82) at
org.apache.lucene.codecs.asserting.AssertingNormsFormat.normsProducer(AssertingNormsFormat.java:50) at
org.apache.lucene.index.SegmentCoreReaders.<init>(SegmentCoreReaders.java:111) at org.apache.lucene.index.SegmentReader.<init>(SegmentReader.java:65) at
org.apache.lucene.index.StandardDirectoryReader$1.doBody(StandardDirectoryReader.java:58) at
org.apache.lucene.index.StandardDirectoryReader$1.doBody(StandardDirectoryReader.java:50) at
org.apache.lucene.index.SegmentInfos$FindSegmentsFile.run(SegmentInfos.java:671) at
org.apache.lucene.index.StandardDirectoryReader.open(StandardDirectoryReader.java:73) at org.apache.lucene.index.DirectoryReader.open(DirectoryReader.java:63) at
org.apache.lucene.search.payloads.TestPayloadTermQuery.testIgnoreSpanScorer(TestPayloadTermQuery.java:236) at sun.reflect.NativeMethodAccessorImpl.invoke0(Native Method) at
sun.reflect.NativeMethodAccessorImpl.invoke(NativeMethodAccessorImpl.java:62) at
sun.reflect.DelegatingMethodAccessorImpl.invoke(DelegatingMethodAccessorImpl.java:43) at java.lang.reflect.Method.invoke(Method.java:502) at
com.carrotsearch.randomizedtesting.RandomizedRunner.invoke(RandomizedRunner.java:1627) at
com.carrotsearch.randomizedtesting.RandomizedRunner$6.evaluate(RandomizedRunner.java:836) at
com.carrotsearch.randomizedtesting.RandomizedRunner$7.evaluate(RandomizedRunner.java:872) at
com.carrotsearch.randomizedtesting.RandomizedRunner$8.evaluate(RandomizedRunner.java:886) at
org.apache.lucene.util.TestRuleSetupTeardownChained$1.evaluate(TestRuleSetupTeardownChained.java:50) at
org.apache.lucene.util.AbstractBeforeAfterRule$1.evaluate(AbstractBeforeAfterRule.java:46) at
org.apache.lucene.util.TestRuleThreadAndTestName$1.evaluate(TestRuleThreadAndTestName.java:49) at
org.apache.lucene.util.TestRuleIgnoreAfterMaxFailures$1.evaluate(TestRuleIgnoreAfterMaxFailures.java:65) at
org.apache.lucene.util.TestRuleMarkFailure$1.evaluate(TestRuleMarkFailure.java:48) at
com.carrotsearch.randomizedtesting.rules.StatementAdapter.evaluate(StatementAdapter.java:36) at
com.carrotsearch.randomizedtesting.ThreadLeakControl$StatementRunner.run(ThreadLeakControl.java:365) at
com.carrotsearch.randomizedtesting.ThreadLeakControl.forkTimeoutingTask(ThreadLeakControl.java:798) at
com.carrotsearch.randomizedtesting.ThreadLeakControl$3.evaluate(ThreadLeakControl.java:458) at
com.carrotsearch.randomizedtesting.RandomizedRunner.runSingleTest(RandomizedRunner.java:845) at
com.carrotsearch.randomizedtesting.RandomizedRunner$3.evaluate(RandomizedRunner.java:747) at
com.carrotsearch.randomizedtesting.RandomizedRunner$4.evaluate(RandomizedRunner.java:781) at
com.carrotsearch.randomizedtesting.RandomizedRunner$5.evaluate(RandomizedRunner.java:792) ... 15 more

FAILED:
org.apache.lucene.codecs.lucene50.TestBlockPostingsFormat.testPostingsEnumOffsets

Error Message: expected:<2> but was:<1>

Stack Trace: java.lang.AssertionError: expected:<2> but was:<1> at
__randomizedtesting.SeedInfo.seed([721798422A6325A1:BDA3EC0C15C13AD5]:0) at org.junit.Assert.fail(Assert.java:93) at org.junit.Assert.failNotEquals(Assert.java:647) at org.junit.Assert.assertEquals(Assert.java:128) at org.junit.Assert.assertEquals(Assert.java:472) at org.junit.Assert.assertEquals(Assert.java:456) at
org.apache.lucene.index.BasePostingsFormatTestCase.testPostingsEnumOffsets(BasePostingsFormatTestCase.java:892) at sun.reflect.NativeMethodAccessorImpl.invoke0(Native Method) at
sun.reflect.NativeMethodAccessorImpl.invoke(NativeMethodAccessorImpl.java:62) at
sun.reflect.DelegatingMethodAccessorImpl.invoke(DelegatingMethodAccessorImpl.java:43) at java.lang.reflect.Method.invoke(Method.java:502) at
com.carrotsearch.randomizedtesting.RandomizedRunner.invoke(RandomizedRunner.java:1627) at
com.carrotsearch.randomizedtesting.RandomizedRunner$6.evaluate(RandomizedRunner.java:836) at
com.carrotsearch.randomizedtesting.RandomizedRunner$7.evaluate(RandomizedRunner.java:872) at
com.carrotsearch.randomizedtesting.RandomizedRunner$8.evaluate(RandomizedRunner.java:886) at
org.apache.lucene.util.TestRuleSetupTeardownChained$1.evaluate(TestRuleSetupTeardownChained.java:50) at
org.apache.lucene.util.AbstractBeforeAfterRule$1.evaluate(AbstractBeforeAfterRule.java:46) at
org.apache.lucene.util.TestRuleThreadAndTestName$1.evaluate(TestRuleThreadAndTestName.java:49) at
org.apache.lucene.util.TestRuleIgnoreAfterMaxFailures$1.evaluate(TestRuleIgnoreAfterMaxFailures.java:65) at
org.apache.lucene.util.TestRuleMarkFailure$1.evaluate(TestRuleMarkFailure.java:48) at
com.carrotsearch.randomizedtesting.rules.StatementAdapter.evaluate(StatementAdapter.java:36) at
com.carrotsearch.randomizedtesting.ThreadLeakControl$StatementRunner.run(ThreadLeakControl.java:365) at
com.carrotsearch.randomizedtesting.ThreadLeakControl.forkTimeoutingTask(ThreadLeakControl.java:798) at
com.carrotsearch.randomizedtesting.ThreadLeakControl$3.evaluate(ThreadLeakControl.java:458) at
com.carrotsearch.randomizedtesting.RandomizedRunner.runSingleTest(RandomizedRunner.java:845) at
com.carrotsearch.randomizedtesting.RandomizedRunner$3.evaluate(RandomizedRunner.java:747) at
com.carrotsearch.randomizedtesting.RandomizedRunner$4.evaluate(RandomizedRunner.java:781) at
com.carrotsearch.randomizedtesting.RandomizedRunner$5.evaluate(RandomizedRunner.java:792) at
org.apache.lucene.util.AbstractBeforeAfterRule$1.evaluate(AbstractBeforeAfterRule.java:46) at
com.carrotsearch.randomizedtesting.rules.StatementAdapter.evaluate(StatementAdapter.java:36) at
org.apache.lucene.util.TestRuleStoreClassName$1.evaluate(TestRuleStoreClassName.java:42) at
com.carrotsearch.randomizedtesting.rules.NoShadowingOrOverridesOnMethodsRule$1.evaluate(NoShadowingOrOverridesOnMethodsRule.java:39) at
com.carrotsearch.randomizedtesting.rules.NoShadowingOrOverridesOnMethodsRule$1.evaluate(NoShadowingOrOverridesOnMethodsRule.java:39) at
com.carrotsearch.randomizedtesting.rules.StatementAdapter.evaluate(StatementAdapter.java:36) at
com.carrotsearch.randomizedtesting.rules.StatementAdapter.evaluate(StatementAdapter.java:36) at
com.carrotsearch.randomizedtesting.rules.StatementAdapter.evaluate(StatementAdapter.java:36) at
org.apache.lucene.util.TestRuleAssertionsRequired$1.evaluate(TestRuleAssertionsRequired.java:54) at
org.apache.lucene.util.TestRuleMarkFailure$1.evaluate(TestRuleMarkFailure.java:48) at
org.apache.lucene.util.TestRuleIgnoreAfterMaxFailures$1.evaluate(TestRuleIgnoreAfterMaxFailures.java:65) at
org.apache.lucene.util.TestRuleIgnoreTestSuites$1.evaluate(TestRuleIgnoreTestSuites.java:55) at
com.carrotsearch.randomizedtesting.rules.StatementAdapter.evaluate(StatementAdapter.java:36) at
com.carrotsearch.randomizedtesting.ThreadLeakControl$StatementRunner.run(ThreadLeakControl.java:365) at java.lang.Thread.run(Thread.java:745)

FAILED:
org.apache.lucene.codecs.lucene50.TestBlockPostingsFormat.testDidntWantFreqsButAskedAnyway

Error Message: expected:<1> but was:<2147483647>

Stack Trace: java.lang.AssertionError: expected:<1> but was:<2147483647> at
__randomizedtesting.SeedInfo.seed([721798422A6325A1:606877EA4D1BCFAB]:0) at org.junit.Assert.fail(Assert.java:93) at org.junit.Assert.failNotEquals(Assert.java:647) at org.junit.Assert.assertEquals(Assert.java:128) at org.junit.Assert.assertEquals(Assert.java:472) at org.junit.Assert.assertEquals(Assert.java:456) at
org.apache.lucene.index.BasePostingsFormatTestCase.testDidntWantFreqsButAskedAnyway(BasePostingsFormatTestCase.java:253) at sun.reflect.NativeMethodAccessorImpl.invoke0(Native Method) at
sun.reflect.NativeMethodAccessorImpl.invoke(NativeMethodAccessorImpl.java:62) at
sun.reflect.DelegatingMethodAccessorImpl.invoke(DelegatingMethodAccessorImpl.java:43) at java.lang.reflect.Method.invoke(Method.java:502) at
com.carrotsearch.randomizedtesting.RandomizedRunner.invoke(RandomizedRunner.java:1627) at
com.carrotsearch.randomizedtesting.RandomizedRunner$6.evaluate(RandomizedRunner.java:836) at
com.carrotsearch.randomizedtesting.RandomizedRunner$7.evaluate(RandomizedRunner.java:872) at
com.carrotsearch.randomizedtesting.RandomizedRunner$8.evaluate(RandomizedRunner.java:886) at
org.apache.lucene.util.TestRuleSetupTeardownChained$1.evaluate(TestRuleSetupTeardownChained.java:50) at
org.apache.lucene.util.AbstractBeforeAfterRule$1.evaluate(AbstractBeforeAfterRule.java:46) at
org.apache.lucene.util.TestRuleThreadAndTestName$1.evaluate(TestRuleThreadAndTestName.java:49) at
org.apache.lucene.util.TestRuleIgnoreAfterMaxFailures$1.evaluate(TestRuleIgnoreAfterMaxFailures.java:65) at
org.apache.lucene.util.TestRuleMarkFailure$1.evaluate(TestRuleMarkFailure.java:48) at
com.carrotsearch.randomizedtesting.rules.StatementAdapter.evaluate(StatementAdapter.java:36) at
com.carrotsearch.randomizedtesting.ThreadLeakControl$StatementRunner.run(ThreadLeakControl.java:365) at
com.carrotsearch.randomizedtesting.ThreadLeakControl.forkTimeoutingTask(ThreadLeakControl.java:798) at
com.carrotsearch.randomizedtesting.ThreadLeakControl$3.evaluate(ThreadLeakControl.java:458) at
com.carrotsearch.randomizedtesting.RandomizedRunner.runSingleTest(RandomizedRunner.java:845) at
com.carrotsearch.randomizedtesting.RandomizedRunner$3.evaluate(RandomizedRunner.java:747) at
com.carrotsearch.randomizedtesting.RandomizedRunner$4.evaluate(RandomizedRunner.java:781) at
com.carrotsearch.randomizedtesting.RandomizedRunner$5.evaluate(RandomizedRunner.java:792) at
org.apache.lucene.util.AbstractBeforeAfterRule$1.evaluate(AbstractBeforeAfterRule.java:46) at
com.carrotsearch.randomizedtesting.rules.StatementAdapter.evaluate(StatementAdapter.java:36) at
org.apache.lucene.util.TestRuleStoreClassName$1.evaluate(TestRuleStoreClassName.java:42) at
com.carrotsearch.randomizedtesting.rules.NoShadowingOrOverridesOnMethodsRule$1.evaluate(NoShadowingOrOverridesOnMethodsRule.java:39) at
com.carrotsearch.randomizedtesting.rules.NoShadowingOrOverridesOnMethodsRule$1.evaluate(NoShadowingOrOverridesOnMethodsRule.java:39) at
com.carrotsearch.randomizedtesting.rules.StatementAdapter.evaluate(StatementAdapter.java:36) at
com.carrotsearch.randomizedtesting.rules.StatementAdapter.evaluate(StatementAdapter.java:36) at
com.carrotsearch.randomizedtesting.rules.StatementAdapter.evaluate(StatementAdapter.java:36) at
org.apache.lucene.util.TestRuleAssertionsRequired$1.evaluate(TestRuleAssertionsRequired.java:54) at
org.apache.lucene.util.TestRuleMarkFailure$1.evaluate(TestRuleMarkFailure.java:48) at
org.apache.lucene.util.TestRuleIgnoreAfterMaxFailures$1.evaluate(TestRuleIgnoreAfterMaxFailures.java:65) at
org.apache.lucene.util.TestRuleIgnoreTestSuites$1.evaluate(TestRuleIgnoreTestSuites.java:55) at
com.carrotsearch.randomizedtesting.rules.StatementAdapter.evaluate(StatementAdapter.java:36) at
com.carrotsearch.randomizedtesting.ThreadLeakControl$StatementRunner.run(ThreadLeakControl.java:365) at java.lang.Thread.run(Thread.java:745)

FAILED:
org.apache.lucene.codecs.lucene50.TestLucene50CompoundFormat.testListAll

Error Message: unpaired high surrogate: da83, followed by: 0

Stack Trace: java.lang.IllegalStateException: unpaired high surrogate: da83, followed by: 0 at
__randomizedtesting.SeedInfo.seed([721798422A6325A1:67F27CC203036659]:0) at
org.apache.lucene.analysis.MockTokenizer.failAlways(MockTokenizer.java:131) at
org.apache.lucene.analysis.MockTokenizer.readCodePoint(MockTokenizer.java:216) at
org.apache.lucene.analysis.MockTokenizer.incrementToken(MockTokenizer.java:164) at
org.apache.lucene.analysis.MockTokenFilter.incrementToken(MockTokenFilter.java:81) at
org.apache.lucene.index.DefaultIndexingChain$PerField.invert(DefaultIndexingChain.java:601) at
org.apache.lucene.index.DefaultIndexingChain.processDocument(DefaultIndexingChain.java:306) at
org.apache.lucene.index.DocumentsWriterPerThread.updateDocuments(DocumentsWriterPerThread.java:274) at
org.apache.lucene.index.DocumentsWriter.updateDocuments(DocumentsWriter.java:417) at
org.apache.lucene.index.IndexWriter.updateDocuments(IndexWriter.java:1299) at
org.apache.lucene.index.IndexWriter.addDocuments(IndexWriter.java:1278) at
org.apache.lucene.index.RandomIndexWriter.addDocument(RandomIndexWriter.java:144) at
org.apache.lucene.index.BaseCompoundFormatTestCase.testListAll(BaseCompoundFormatTestCase.java:201) at sun.reflect.NativeMethodAccessorImpl.invoke0(Native Method) at
sun.reflect.NativeMethodAccessorImpl.invoke(NativeMethodAccessorImpl.java:62) at
sun.reflect.DelegatingMethodAccessorImpl.invoke(DelegatingMethodAccessorImpl.java:43) at java.lang.reflect.Method.invoke(Method.java:502) at
com.carrotsearch.randomizedtesting.RandomizedRunner.invoke(RandomizedRunner.java:1627) at
com.carrotsearch.randomizedtesting.RandomizedRunner$6.evaluate(RandomizedRunner.java:836) at
com.carrotsearch.randomizedtesting.RandomizedRunner$7.evaluate(RandomizedRunner.java:872) at
com.carrotsearch.randomizedtesting.RandomizedRunner$8.evaluate(RandomizedRunner.java:886) at
org.apache.lucene.util.TestRuleSetupTeardownChained$1.evaluate(TestRuleSetupTeardownChained.java:50) at
org.apache.lucene.util.AbstractBeforeAfterRule$1.evaluate(AbstractBeforeAfterRule.java:46) at
org.apache.lucene.util.TestRuleThreadAndTestName$1.evaluate(TestRuleThreadAndTestName.java:49) at
org.apache.lucene.util.TestRuleIgnoreAfterMaxFailures$1.evaluate(TestRuleIgnoreAfterMaxFailures.java:65) at
org.apache.lucene.util.TestRuleMarkFailure$1.evaluate(TestRuleMarkFailure.java:48) at
com.carrotsearch.randomizedtesting.rules.StatementAdapter.evaluate(StatementAdapter.java:36) at
com.carrotsearch.randomizedtesting.ThreadLeakControl$StatementRunner.run(ThreadLeakControl.java:365) at
com.carrotsearch.randomizedtesting.ThreadLeakControl.forkTimeoutingTask(ThreadLeakControl.java:798) at
com.carrotsearch.randomizedtesting.ThreadLeakControl$3.evaluate(ThreadLeakControl.java:458) at
com.carrotsearch.randomizedtesting.RandomizedRunner.runSingleTest(RandomizedRunner.java:845) at
com.carrotsearch.randomizedtesting.RandomizedRunner$3.evaluate(RandomizedRunner.java:747) at
com.carrotsearch.randomizedtesting.RandomizedRunner$4.evaluate(RandomizedRunner.java:781) at
com.carrotsearch.randomizedtesting.RandomizedRunner$5.evaluate(RandomizedRunner.java:792) at
org.apache.lucene.util.AbstractBeforeAfterRule$1.evaluate(AbstractBeforeAfterRule.java:46) at
com.carrotsearch.randomizedtesting.rules.StatementAdapter.evaluate(StatementAdapter.java:36) at
org.apache.lucene.util.TestRuleStoreClassName$1.evaluate(TestRuleStoreClassName.java:42) at
com.carrotsearch.randomizedtesting.rules.NoShadowingOrOverridesOnMethodsRule$1.evaluate(NoShadowingOrOverridesOnMethodsRule.java:39) at
com.carrotsearch.randomizedtesting.rules.NoShadowingOrOverridesOnMethodsRule$1.evaluate(NoShadowingOrOverridesOnMethodsRule.java:39) at
com.carrotsearch.randomizedtesting.rules.StatementAdapter.evaluate(StatementAdapter.java:36) at
com.carrotsearch.randomizedtesting.rules.StatementAdapter.evaluate(StatementAdapter.java:36) at
com.carrotsearch.randomizedtesting.rules.StatementAdapter.evaluate(StatementAdapter.java:36) at
org.apache.lucene.util.TestRuleAssertionsRequired$1.evaluate(TestRuleAssertionsRequired.java:54) at
org.apache.lucene.util.TestRuleMarkFailure$1.evaluate(TestRuleMarkFailure.java:48) at
org.apache.lucene.util.TestRuleIgnoreAfterMaxFailures$1.evaluate(TestRuleIgnoreAfterMaxFailures.java:65) at
org.apache.lucene.util.TestRuleIgnoreTestSuites$1.evaluate(TestRuleIgnoreTestSuites.java:55) at
com.carrotsearch.randomizedtesting.rules.StatementAdapter.evaluate(StatementAdapter.java:36) at
com.carrotsearch.randomizedtesting.ThreadLeakControl$StatementRunner.run(ThreadLeakControl.java:365) at java.lang.Thread.run(Thread.java:745) Suppressed: java.lang.IllegalStateException: close() called in wrong
state: RESET at
org.apache.lucene.analysis.MockTokenizer.fail(MockTokenizer.java:126) at
org.apache.lucene.analysis.MockTokenizer.close(MockTokenizer.java:293) at
org.apache.lucene.analysis.TokenFilter.close(TokenFilter.java:58) at
org.apache.lucene.index.DefaultIndexingChain$PerField.invert(DefaultIndexingChain.java:675) ... 43 more

FAILED:
org.apache.lucene.codecs.perfield.TestPerFieldPostingsFormat.testPostingsEnumOffsets

Error Message:

Stack Trace: java.lang.NullPointerException at
__randomizedtesting.SeedInfo.seed([721798422A6325A1:BDA3EC0C15C13AD5]:0) at
org.apache.lucene.index.BasePostingsFormatTestCase.testPostingsEnumOffsets(BasePostingsFormatTestCase.java:890) at sun.reflect.NativeMethodAccessorImpl.invoke0(Native Method) at
sun.reflect.NativeMethodAccessorImpl.invoke(NativeMethodAccessorImpl.java:62) at
sun.reflect.DelegatingMethodAccessorImpl.invoke(DelegatingMethodAccessorImpl.java:43) at java.lang.reflect.Method.invoke(Method.java:502) at
com.carrotsearch.randomizedtesting.RandomizedRunner.invoke(RandomizedRunner.java:1627) at
com.carrotsearch.randomizedtesting.RandomizedRunner$6.evaluate(RandomizedRunner.java:836) at
com.carrotsearch.randomizedtesting.RandomizedRunner$7.evaluate(RandomizedRunner.java:872) at
com.carrotsearch.randomizedtesting.RandomizedRunner$8.evaluate(RandomizedRunner.java:886) at
org.apache.lucene.util.TestRuleSetupTeardownChained$1.evaluate(TestRuleSetupTeardownChained.java:50) at
org.apache.lucene.util.AbstractBeforeAfterRule$1.evaluate(AbstractBeforeAfterRule.java:46) at
org.apache.lucene.util.TestRuleThreadAndTestName$1.evaluate(TestRuleThreadAndTestName.java:49) at
org.apache.lucene.util.TestRuleIgnoreAfterMaxFailures$1.evaluate(TestRuleIgnoreAfterMaxFailures.java:65) at
org.apache.lucene.util.TestRuleMarkFailure$1.evaluate(TestRuleMarkFailure.java:48) at
com.carrotsearch.randomizedtesting.rules.StatementAdapter.evaluate(StatementAdapter.java:36) at
com.carrotsearch.randomizedtesting.ThreadLeakControl$StatementRunner.run(ThreadLeakControl.java:365) at
com.carrotsearch.randomizedtesting.ThreadLeakControl.forkTimeoutingTask(ThreadLeakControl.java:798) at
com.carrotsearch.randomizedtesting.ThreadLeakControl$3.evaluate(ThreadLeakControl.java:458) at
com.carrotsearch.randomizedtesting.RandomizedRunner.runSingleTest(RandomizedRunner.java:845) at
com.carrotsearch.randomizedtesting.RandomizedRunner$3.evaluate(RandomizedRunner.java:747) at
com.carrotsearch.randomizedtesting.RandomizedRunner$4.evaluate(RandomizedRunner.java:781) at
com.carrotsearch.randomizedtesting.RandomizedRunner$5.evaluate(RandomizedRunner.java:792) at
org.apache.lucene.util.AbstractBeforeAfterRule$1.evaluate(AbstractBeforeAfterRule.java:46) at
com.carrotsearch.randomizedtesting.rules.StatementAdapter.evaluate(StatementAdapter.java:36) at
org.apache.lucene.util.TestRuleStoreClassName$1.evaluate(TestRuleStoreClassName.java:42) at
com.carrotsearch.randomizedtesting.rules.NoShadowingOrOverridesOnMethodsRule$1.evaluate(NoShadowingOrOverridesOnMethodsRule.java:39) at
com.carrotsearch.randomizedtesting.rules.NoShadowingOrOverridesOnMethodsRule$1.evaluate(NoShadowingOrOverridesOnMethodsRule.java:39) at
com.carrotsearch.randomizedtesting.rules.StatementAdapter.evaluate(StatementAdapter.java:36) at
com.carrotsearch.randomizedtesting.rules.StatementAdapter.evaluate(StatementAdapter.java:36) at
com.carrotsearch.randomizedtesting.rules.StatementAdapter.evaluate(StatementAdapter.java:36) at
org.apache.lucene.util.TestRuleAssertionsRequired$1.evaluate(TestRuleAssertionsRequired.java:54) at
org.apache.lucene.util.TestRuleMarkFailure$1.evaluate(TestRuleMarkFailure.java:48) at
org.apache.lucene.util.TestRuleIgnoreAfterMaxFailures$1.evaluate(TestRuleIgnoreAfterMaxFailures.java:65) at
org.apache.lucene.util.TestRuleIgnoreTestSuites$1.evaluate(TestRuleIgnoreTestSuites.java:55) at
com.carrotsearch.randomizedtesting.rules.StatementAdapter.evaluate(StatementAdapter.java:36) at
com.carrotsearch.randomizedtesting.ThreadLeakControl$StatementRunner.run(ThreadLeakControl.java:365) at java.lang.Thread.run(Thread.java:745)

FAILED:
org.apache.lucene.codecs.perfield.TestPerFieldPostingsFormat.testDidntWantFreqsButAskedAnyway

Error Message: expected:<1> but was:<2147483647>

Stack Trace: java.lang.AssertionError: expected:<1> but was:<2147483647> at
__randomizedtesting.SeedInfo.seed([721798422A6325A1:606877EA4D1BCFAB]:0) at org.junit.Assert.fail(Assert.java:93) at org.junit.Assert.failNotEquals(Assert.java:647) at org.junit.Assert.assertEquals(Assert.java:128) at org.junit.Assert.assertEquals(Assert.java:472) at org.junit.Assert.assertEquals(Assert.java:456) at
org.apache.lucene.index.BasePostingsFormatTestCase.testDidntWantFreqsButAskedAnyway(BasePostingsFormatTestCase.java:253) at sun.reflect.NativeMethodAccessorImpl.invoke0(Native Method) at
sun.reflect.NativeMethodAccessorImpl.invoke(NativeMethodAccessorImpl.java:62) at
sun.reflect.DelegatingMethodAccessorImpl.invoke(DelegatingMethodAccessorImpl.java:43) at java.lang.reflect.Method.invoke(Method.java:502) at
com.carrotsearch.randomizedtesting.RandomizedRunner.invoke(RandomizedRunner.java:1627) at
com.carrotsearch.randomizedtesting.RandomizedRunner$6.evaluate(RandomizedRunner.java:836) at
com.carrotsearch.randomizedtesting.RandomizedRunner$7.evaluate(RandomizedRunner.java:872) at
com.carrotsearch.randomizedtesting.RandomizedRunner$8.evaluate(RandomizedRunner.java:886) at
org.apache.lucene.util.TestRuleSetupTeardownChained$1.evaluate(TestRuleSetupTeardownChained.java:50) at
org.apache.lucene.util.AbstractBeforeAfterRule$1.evaluate(AbstractBeforeAfterRule.java:46) at
org.apache.lucene.util.TestRuleThreadAndTestName$1.evaluate(TestRuleThreadAndTestName.java:49) at
org.apache.lucene.util.TestRuleIgnoreAfterMaxFailures$1.evaluate(TestRuleIgnoreAfterMaxFailures.java:65) at
org.apache.lucene.util.TestRuleMarkFailure$1.evaluate(TestRuleMarkFailure.java:48) at
com.carrotsearch.randomizedtesting.rules.StatementAdapter.evaluate(StatementAdapter.java:36) at
com.carrotsearch.randomizedtesting.ThreadLeakControl$StatementRunner.run(ThreadLeakControl.java:365) at
com.carrotsearch.randomizedtesting.ThreadLeakControl.forkTimeoutingTask(ThreadLeakControl.java:798) at
com.carrotsearch.randomizedtesting.ThreadLeakControl$3.evaluate(ThreadLeakControl.java:458) at
com.carrotsearch.randomizedtesting.RandomizedRunner.runSingleTest(RandomizedRunner.java:845) at
com.carrotsearch.randomizedtesting.RandomizedRunner$3.evaluate(RandomizedRunner.java:747) at
com.carrotsearch.randomizedtesting.RandomizedRunner$4.evaluate(RandomizedRunner.java:781) at
com.carrotsearch.randomizedtesting.RandomizedRunner$5.evaluate(RandomizedRunner.java:792) at
org.apache.lucene.util.AbstractBeforeAfterRule$1.evaluate(AbstractBeforeAfterRule.java:46) at
com.carrotsearch.randomizedtesting.rules.StatementAdapter.evaluate(StatementAdapter.java:36) at
org.apache.lucene.util.TestRuleStoreClassName$1.evaluate(TestRuleStoreClassName.java:42) at
com.carrotsearch.randomizedtesting.rules.NoShadowingOrOverridesOnMethodsRule$1.evaluate(NoShadowingOrOverridesOnMethodsRule.java:39) at
com.carrotsearch.randomizedtesting.rules.NoShadowingOrOverridesOnMethodsRule$1.evaluate(NoShadowingOrOverridesOnMethodsRule.java:39) at
com.carrotsearch.randomizedtesting.rules.StatementAdapter.evaluate(StatementAdapter.java:36) at
com.carrotsearch.randomizedtesting.rules.StatementAdapter.evaluate(StatementAdapter.java:36) at
com.carrotsearch.randomizedtesting.rules.StatementAdapter.evaluate(StatementAdapter.java:36) at
org.apache.lucene.util.TestRuleAssertionsRequired$1.evaluate(TestRuleAssertionsRequired.java:54) at
org.apache.lucene.util.TestRuleMarkFailure$1.evaluate(TestRuleMarkFailure.java:48) at
org.apache.lucene.util.TestRuleIgnoreAfterMaxFailures$1.evaluate(TestRuleIgnoreAfterMaxFailures.java:65) at
org.apache.lucene.util.TestRuleIgnoreTestSuites$1.evaluate(TestRuleIgnoreTestSuites.java:55) at
com.carrotsearch.randomizedtesting.rules.StatementAdapter.evaluate(StatementAdapter.java:36) at
com.carrotsearch.randomizedtesting.ThreadLeakControl$StatementRunner.run(ThreadLeakControl.java:365) at java.lang.Thread.run(Thread.java:745)

FAILED: org.apache.lucene.index.TestAllFilesHaveChecksumFooter.test

Error Message: unpaired high surrogate: d988, followed by: 0

Stack Trace: java.lang.IllegalStateException: unpaired high surrogate: d988, followed by: 0 at
__randomizedtesting.SeedInfo.seed([721798422A6325A1:FA43A798849F4859]:0) at
org.apache.lucene.analysis.MockTokenizer.failAlways(MockTokenizer.java:131) at
org.apache.lucene.analysis.MockTokenizer.readCodePoint(MockTokenizer.java:216) at
org.apache.lucene.analysis.MockTokenizer.incrementToken(MockTokenizer.java:164) at
org.apache.lucene.analysis.MockTokenFilter.incrementToken(MockTokenFilter.java:81) at
org.apache.lucene.index.DefaultIndexingChain$PerField.invert(DefaultIndexingChain.java:601) at
org.apache.lucene.index.DefaultIndexingChain.processDocument(DefaultIndexingChain.java:306) at
org.apache.lucene.index.DocumentsWriterPerThread.updateDocument(DocumentsWriterPerThread.java:234) at
org.apache.lucene.index.DocumentsWriter.updateDocument(DocumentsWriter.java:455) at
org.apache.lucene.index.IndexWriter.updateDocument(IndexWriter.java:1458) at
org.apache.lucene.index.IndexWriter.addDocument(IndexWriter.java:1237) at
org.apache.lucene.index.RandomIndexWriter.addDocument(RandomIndexWriter.java:173) at
org.apache.lucene.index.TestAllFilesHaveChecksumFooter.test(TestAllFilesHaveChecksumFooter.java:52) at sun.reflect.NativeMethodAccessorImpl.invoke0(Native Method) at
sun.reflect.NativeMethodAccessorImpl.invoke(NativeMethodAccessorImpl.java:62) at
sun.reflect.DelegatingMethodAccessorImpl.invoke(DelegatingMethodAccessorImpl.java:43) at java.lang.reflect.Method.invoke(Method.java:502) at
com.carrotsearch.randomizedtesting.RandomizedRunner.invoke(RandomizedRunner.java:1627) at
com.carrotsearch.randomizedtesting.RandomizedRunner$6.evaluate(RandomizedRunner.java:836) at
com.carrotsearch.randomizedtesting.RandomizedRunner$7.evaluate(RandomizedRunner.java:872) at
com.carrotsearch.randomizedtesting.RandomizedRunner$8.evaluate(RandomizedRunner.java:886) at
org.apache.lucene.util.TestRuleSetupTeardownChained$1.evaluate(TestRuleSetupTeardownChained.java:50) at
org.apache.lucene.util.AbstractBeforeAfterRule$1.evaluate(AbstractBeforeAfterRule.java:46) at
org.apache.lucene.util.TestRuleThreadAndTestName$1.evaluate(TestRuleThreadAndTestName.java:49) at
org.apache.lucene.util.TestRuleIgnoreAfterMaxFailures$1.evaluate(TestRuleIgnoreAfterMaxFailures.java:65) at
org.apache.lucene.util.TestRuleMarkFailure$1.evaluate(TestRuleMarkFailure.java:48) at
com.carrotsearch.randomizedtesting.rules.StatementAdapter.evaluate(StatementAdapter.java:36) at
com.carrotsearch.randomizedtesting.ThreadLeakControl$StatementRunner.run(ThreadLeakControl.java:365) at
com.carrotsearch.randomizedtesting.ThreadLeakControl.forkTimeoutingTask(ThreadLeakControl.java:798) at
com.carrotsearch.randomizedtesting.ThreadLeakControl$3.evaluate(ThreadLeakControl.java:458) at
com.carrotsearch.randomizedtesting.RandomizedRunner.runSingleTest(RandomizedRunner.java:845) at
com.carrotsearch.randomizedtesting.RandomizedRunner$3.evaluate(RandomizedRunner.java:747) at
com.carrotsearch.randomizedtesting.RandomizedRunner$4.evaluate(RandomizedRunner.java:781) at
com.carrotsearch.randomizedtesting.RandomizedRunner$5.evaluate(RandomizedRunner.java:792) at
org.apache.lucene.util.AbstractBeforeAfterRule$1.evaluate(AbstractBeforeAfterRule.java:46) at
com.carrotsearch.randomizedtesting.rules.StatementAdapter.evaluate(StatementAdapter.java:36) at
org.apache.lucene.util.TestRuleStoreClassName$1.evaluate(TestRuleStoreClassName.java:42) at
com.carrotsearch.randomizedtesting.rules.NoShadowingOrOverridesOnMethodsRule$1.evaluate(NoShadowingOrOverridesOnMethodsRule.java:39) at
com.carrotsearch.randomizedtesting.rules.NoShadowingOrOverridesOnMethodsRule$1.evaluate(NoShadowingOrOverridesOnMethodsRule.java:39) at
com.carrotsearch.randomizedtesting.rules.StatementAdapter.evaluate(StatementAdapter.java:36) at
com.carrotsearch.randomizedtesting.rules.StatementAdapter.evaluate(StatementAdapter.java:36) at
com.carrotsearch.randomizedtesting.rules.StatementAdapter.evaluate(StatementAdapter.java:36) at
org.apache.lucene.util.TestRuleAssertionsRequired$1.evaluate(TestRuleAssertionsRequired.java:54) at
org.apache.lucene.util.TestRuleMarkFailure$1.evaluate(TestRuleMarkFailure.java:48) at
org.apache.lucene.util.TestRuleIgnoreAfterMaxFailures$1.evaluate(TestRuleIgnoreAfterMaxFailures.java:65) at
org.apache.lucene.util.TestRuleIgnoreTestSuites$1.evaluate(TestRuleIgnoreTestSuites.java:55) at
com.carrotsearch.randomizedtesting.rules.StatementAdapter.evaluate(StatementAdapter.java:36) at
com.carrotsearch.randomizedtesting.ThreadLeakControl$StatementRunner.run(ThreadLeakControl.java:365) at java.lang.Thread.run(Thread.java:745) Suppressed: java.lang.IllegalStateException: close() called in wrong
state: RESET at
org.apache.lucene.analysis.MockTokenizer.fail(MockTokenizer.java:126) at
org.apache.lucene.analysis.MockTokenizer.close(MockTokenizer.java:293) at
org.apache.lucene.analysis.TokenFilter.close(TokenFilter.java:58) at
org.apache.lucene.index.DefaultIndexingChain$PerField.invert(DefaultIndexingChain.java:675) ... 43 more

FAILED: org.apache.lucene.index.TestBagOfPositions.test

Error Message: expected:<1091> but was:<50158>

Stack Trace: java.lang.AssertionError: expected:<1091> but was:<50158> at
__randomizedtesting.SeedInfo.seed([721798422A6325A1:FA43A798849F4859]:0) at org.junit.Assert.fail(Assert.java:93) at org.junit.Assert.failNotEquals(Assert.java:647) at org.junit.Assert.assertEquals(Assert.java:128) at org.junit.Assert.assertEquals(Assert.java:472) at org.junit.Assert.assertEquals(Assert.java:456) at
org.apache.lucene.index.TestBagOfPositions.test(TestBagOfPositions.java:139) at sun.reflect.NativeMethodAccessorImpl.invoke0(Native Method) at
sun.reflect.NativeMethodAccessorImpl.invoke(NativeMethodAccessorImpl.java:62) at
sun.reflect.DelegatingMethodAccessorImpl.invoke(DelegatingMethodAccessorImpl.java:43) at java.lang.reflect.Method.invoke(Method.java:502) at
com.carrotsearch.randomizedtesting.RandomizedRunner.invoke(RandomizedRunner.java:1627) at
com.carrotsearch.randomizedtesting.RandomizedRunner$6.evaluate(RandomizedRunner.java:836) at
com.carrotsearch.randomizedtesting.RandomizedRunner$7.evaluate(RandomizedRunner.java:872) at
com.carrotsearch.randomizedtesting.RandomizedRunner$8.evaluate(RandomizedRunner.java:886) at
org.apache.lucene.util.TestRuleSetupTeardownChained$1.evaluate(TestRuleSetupTeardownChained.java:50) at
org.apache.lucene.util.AbstractBeforeAfterRule$1.evaluate(AbstractBeforeAfterRule.java:46) at
org.apache.lucene.util.TestRuleThreadAndTestName$1.evaluate(TestRuleThreadAndTestName.java:49) at
org.apache.lucene.util.TestRuleIgnoreAfterMaxFailures$1.evaluate(TestRuleIgnoreAfterMaxFailures.java:65) at
org.apache.lucene.util.TestRuleMarkFailure$1.evaluate(TestRuleMarkFailure.java:48) at
com.carrotsearch.randomizedtesting.rules.StatementAdapter.evaluate(StatementAdapter.java:36) at
com.carrotsearch.randomizedtesting.ThreadLeakControl$StatementRunner.run(ThreadLeakControl.java:365) at
com.carrotsearch.randomizedtesting.ThreadLeakControl.forkTimeoutingTask(ThreadLeakControl.java:798) at
com.carrotsearch.randomizedtesting.ThreadLeakControl$3.evaluate(ThreadLeakControl.java:458) at
com.carrotsearch.randomizedtesting.RandomizedRunner.runSingleTest(RandomizedRunner.java:845) at
com.carrotsearch.randomizedtesting.RandomizedRunner$3.evaluate(RandomizedRunner.java:747) at
com.carrotsearch.randomizedtesting.RandomizedRunner$4.evaluate(RandomizedRunner.java:781) at
com.carrotsearch.randomizedtesting.RandomizedRunner$5.evaluate(RandomizedRunner.java:792) at
org.apache.lucene.util.AbstractBeforeAfterRule$1.evaluate(AbstractBeforeAfterRule.java:46) at
com.carrotsearch.randomizedtesting.rules.StatementAdapter.evaluate(StatementAdapter.java:36) at
org.apache.lucene.util.TestRuleStoreClassName$1.evaluate(TestRuleStoreClassName.java:42) at
com.carrotsearch.randomizedtesting.rules.NoShadowingOrOverridesOnMethodsRule$1.evaluate(NoShadowingOrOverridesOnMethodsRule.java:39) at
com.carrotsearch.randomizedtesting.rules.NoShadowingOrOverridesOnMethodsRule$1.evaluate(NoShadowingOrOverridesOnMethodsRule.java:39) at
com.carrotsearch.randomizedtesting.rules.StatementAdapter.evaluate(StatementAdapter.java:36) at
com.carrotsearch.randomizedtesting.rules.StatementAdapter.evaluate(StatementAdapter.java:36) at
com.carrotsearch.randomizedtesting.rules.StatementAdapter.evaluate(StatementAdapter.java:36) at
org.apache.lucene.util.TestRuleAssertionsRequired$1.evaluate(TestRuleAssertionsRequired.java:54) at
org.apache.lucene.util.TestRuleMarkFailure$1.evaluate(TestRuleMarkFailure.java:48) at
org.apache.lucene.util.TestRuleIgnoreAfterMaxFailures$1.evaluate(TestRuleIgnoreAfterMaxFailures.java:65) at
org.apache.lucene.util.TestRuleIgnoreTestSuites$1.evaluate(TestRuleIgnoreTestSuites.java:55) at
com.carrotsearch.randomizedtesting.rules.StatementAdapter.evaluate(StatementAdapter.java:36) at
com.carrotsearch.randomizedtesting.ThreadLeakControl$StatementRunner.run(ThreadLeakControl.java:365) at java.lang.Thread.run(Thread.java:745)

FAILED: org.apache.lucene.index.TestDirectoryReader.testMultiTermDocs

Error Message:

Stack Trace: java.lang.NullPointerException at
__randomizedtesting.SeedInfo.seed([721798422A6325A1:F83E2CAAC3E34C0A]:0) at
org.apache.lucene.codecs.blocktree.SegmentTermsEnum.seekExact(SegmentTermsEnum.java:326) at
org.apache.lucene.index.MultiTermsEnum.seekExact(MultiTermsEnum.java:158) at org.apache.lucene.util.TestUtil.docs(TestUtil.java:1090) at
org.apache.lucene.index.TestDirectoryReader.testMultiTermDocs(TestDirectoryReader.java:96) at sun.reflect.NativeMethodAccessorImpl.invoke0(Native Method) at
sun.reflect.NativeMethodAccessorImpl.invoke(NativeMethodAccessorImpl.java:62) at
sun.reflect.DelegatingMethodAccessorImpl.invoke(DelegatingMethodAccessorImpl.java:43) at java.lang.reflect.Method.invoke(Method.java:502) at
com.carrotsearch.randomizedtesting.RandomizedRunner.invoke(RandomizedRunner.java:1627) at
com.carrotsearch.randomizedtesting.RandomizedRunner$6.evaluate(RandomizedRunner.java:836) at
com.carrotsearch.randomizedtesting.RandomizedRunner$7.evaluate(RandomizedRunner.java:872) at
com.carrotsearch.randomizedtesting.RandomizedRunner$8.evaluate(RandomizedRunner.java:886) at
org.apache.lucene.util.TestRuleSetupTeardownChained$1.evaluate(TestRuleSetupTeardownChained.java:50) at
org.apache.lucene.util.AbstractBeforeAfterRule$1.evaluate(AbstractBeforeAfterRule.java:46) at
org.apache.lucene.util.TestRuleThreadAndTestName$1.evaluate(TestRuleThreadAndTestName.java:49) at
org.apache.lucene.util.TestRuleIgnoreAfterMaxFailures$1.evaluate(TestRuleIgnoreAfterMaxFailures.java:65) at
org.apache.lucene.util.TestRuleMarkFailure$1.evaluate(TestRuleMarkFailure.java:48) at
com.carrotsearch.randomizedtesting.rules.StatementAdapter.evaluate(StatementAdapter.java:36) at
com.carrotsearch.randomizedtesting.ThreadLeakControl$StatementRunner.run(ThreadLeakControl.java:365) at
com.carrotsearch.randomizedtesting.ThreadLeakControl.forkTimeoutingTask(ThreadLeakControl.java:798) at
com.carrotsearch.randomizedtesting.ThreadLeakControl$3.evaluate(ThreadLeakControl.java:458) at
com.carrotsearch.randomizedtesting.RandomizedRunner.runSingleTest(RandomizedRunner.java:845) at
com.carrotsearch.randomizedtesting.RandomizedRunner$3.evaluate(RandomizedRunner.java:747) at
com.carrotsearch.randomizedtesting.RandomizedRunner$4.evaluate(RandomizedRunner.java:781) at
com.carrotsearch.randomizedtesting.RandomizedRunner$5.evaluate(RandomizedRunner.java:792) at
org.apache.lucene.util.AbstractBeforeAfterRule$1.evaluate(AbstractBeforeAfterRule.java:46) at
com.carrotsearch.randomizedtesting.rules.StatementAdapter.evaluate(StatementAdapter.java:36) at
org.apache.lucene.util.TestRuleStoreClassName$1.evaluate(TestRuleStoreClassName.java:42) at
com.carrotsearch.randomizedtesting.rules.NoShadowingOrOverridesOnMethodsRule$1.evaluate(NoShadowingOrOverridesOnMethodsRule.java:39) at
com.carrotsearch.randomizedtesting.rules.NoShadowingOrOverridesOnMethodsRule$1.evaluate(NoShadowingOrOverridesOnMethodsRule.java:39) at
com.carrotsearch.randomizedtesting.rules.StatementAdapter.evaluate(StatementAdapter.java:36) at
com.carrotsearch.randomizedtesting.rules.StatementAdapter.evaluate(StatementAdapter.java:36) at
com.carrotsearch.randomizedtesting.rules.StatementAdapter.evaluate(StatementAdapter.java:36) at
org.apache.lucene.util.TestRuleAssertionsRequired$1.evaluate(TestRuleAssertionsRequired.java:54) at
org.apache.lucene.util.TestRuleMarkFailure$1.evaluate(TestRuleMarkFailure.java:48) at
org.apache.lucene.util.TestRuleIgnoreAfterMaxFailures$1.evaluate(TestRuleIgnoreAfterMaxFailures.java:65) at
org.apache.lucene.util.TestRuleIgnoreTestSuites$1.evaluate(TestRuleIgnoreTestSuites.java:55) at
com.carrotsearch.randomizedtesting.rules.StatementAdapter.evaluate(StatementAdapter.java:36) at
com.carrotsearch.randomizedtesting.ThreadLeakControl$StatementRunner.run(ThreadLeakControl.java:365) at java.lang.Thread.run(Thread.java:745)

FAILED: org.apache.lucene.index.TestDirectoryReader.testUniqueTermCount

Error Message: expected:<26> but was:<28>

Stack Trace: java.lang.AssertionError: expected:<26> but was:<28> at
__randomizedtesting.SeedInfo.seed([721798422A6325A1:E362F3BD979DE372]:0) at org.junit.Assert.fail(Assert.java:93) at org.junit.Assert.failNotEquals(Assert.java:647) at org.junit.Assert.assertEquals(Assert.java:128) at org.junit.Assert.assertEquals(Assert.java:472) at org.junit.Assert.assertEquals(Assert.java:456) at
org.apache.lucene.index.TestDirectoryReader.testUniqueTermCount(TestDirectoryReader.java:769) at sun.reflect.NativeMethodAccessorImpl.invoke0(Native Method) at
sun.reflect.NativeMethodAccessorImpl.invoke(NativeMethodAccessorImpl.java:62) at
sun.reflect.DelegatingMethodAccessorImpl.invoke(DelegatingMethodAccessorImpl.java:43) at java.lang.reflect.Method.invoke(Method.java:502) at
com.carrotsearch.randomizedtesting.RandomizedRunner.invoke(RandomizedRunner.java:1627) at
com.carrotsearch.randomizedtesting.RandomizedRunner$6.evaluate(RandomizedRunner.java:836) at
com.carrotsearch.randomizedtesting.RandomizedRunner$7.evaluate(RandomizedRunner.java:872) at
com.carrotsearch.randomizedtesting.RandomizedRunner$8.evaluate(RandomizedRunner.java:886) at
org.apache.lucene.util.TestRuleSetupTeardownChained$1.evaluate(TestRuleSetupTeardownChained.java:50) at
org.apache.lucene.util.AbstractBeforeAfterRule$1.evaluate(AbstractBeforeAfterRule.java:46) at
org.apache.lucene.util.TestRuleThreadAndTestName$1.evaluate(TestRuleThreadAndTestName.java:49) at
org.apache.lucene.util.TestRuleIgnoreAfterMaxFailures$1.evaluate(TestRuleIgnoreAfterMaxFailures.java:65) at
org.apache.lucene.util.TestRuleMarkFailure$1.evaluate(TestRuleMarkFailure.java:48) at
com.carrotsearch.randomizedtesting.rules.StatementAdapter.evaluate(StatementAdapter.java:36) at
com.carrotsearch.randomizedtesting.ThreadLeakControl$StatementRunner.run(ThreadLeakControl.java:365) at
com.carrotsearch.randomizedtesting.ThreadLeakControl.forkTimeoutingTask(ThreadLeakControl.java:798) at
com.carrotsearch.randomizedtesting.ThreadLeakControl$3.evaluate(ThreadLeakControl.java:458) at
com.carrotsearch.randomizedtesting.RandomizedRunner.runSingleTest(RandomizedRunner.java:845) at
com.carrotsearch.randomizedtesting.RandomizedRunner$3.evaluate(RandomizedRunner.java:747) at
com.carrotsearch.randomizedtesting.RandomizedRunner$4.evaluate(RandomizedRunner.java:781) at
com.carrotsearch.randomizedtesting.RandomizedRunner$5.evaluate(RandomizedRunner.java:792) at
org.apache.lucene.util.AbstractBeforeAfterRule$1.evaluate(AbstractBeforeAfterRule.java:46) at
com.carrotsearch.randomizedtesting.rules.StatementAdapter.evaluate(StatementAdapter.java:36) at
org.apache.lucene.util.TestRuleStoreClassName$1.evaluate(TestRuleStoreClassName.java:42) at
com.carrotsearch.randomizedtesting.rules.NoShadowingOrOverridesOnMethodsRule$1.evaluate(NoShadowingOrOverridesOnMethodsRule.java:39) at
com.carrotsearch.randomizedtesting.rules.NoShadowingOrOverridesOnMethodsRule$1.evaluate(NoShadowingOrOverridesOnMethodsRule.java:39) at
com.carrotsearch.randomizedtesting.rules.StatementAdapter.evaluate(StatementAdapter.java:36) at
com.carrotsearch.randomizedtesting.rules.StatementAdapter.evaluate(StatementAdapter.java:36) at
com.carrotsearch.randomizedtesting.rules.StatementAdapter.evaluate(StatementAdapter.java:36) at
org.apache.lucene.util.TestRuleAssertionsRequired$1.evaluate(TestRuleAssertionsRequired.java:54) at
org.apache.lucene.util.TestRuleMarkFailure$1.evaluate(TestRuleMarkFailure.java:48) at
org.apache.lucene.util.TestRuleIgnoreAfterMaxFailures$1.evaluate(TestRuleIgnoreAfterMaxFailures.java:65) at
org.apache.lucene.util.TestRuleIgnoreTestSuites$1.evaluate(TestRuleIgnoreTestSuites.java:55) at
com.carrotsearch.randomizedtesting.rules.StatementAdapter.evaluate(StatementAdapter.java:36) at
com.carrotsearch.randomizedtesting.ThreadLeakControl$StatementRunner.run(ThreadLeakControl.java:365) at java.lang.Thread.run(Thread.java:745)

FAILED: org.apache.lucene.index.TestDocsAndPositions.testRandomDocs

Error Message: expected:<112> but was:<2147483647>

Stack Trace: java.lang.AssertionError: expected:<112> but was:<2147483647> at
__randomizedtesting.SeedInfo.seed([721798422A6325A1:BE2F96437CA6095D]:0) at org.junit.Assert.fail(Assert.java:93) at org.junit.Assert.failNotEquals(Assert.java:647) at org.junit.Assert.assertEquals(Assert.java:128) at org.junit.Assert.assertEquals(Assert.java:472) at org.junit.Assert.assertEquals(Assert.java:456) at
org.apache.lucene.index.TestDocsAndPositions.testRandomDocs(TestDocsAndPositions.java:238) at sun.reflect.NativeMethodAccessorImpl.invoke0(Native Method) at
sun.reflect.NativeMethodAccessorImpl.invoke(NativeMethodAccessorImpl.java:62) at
sun.reflect.DelegatingMethodAccessorImpl.invoke(DelegatingMethodAccessorImpl.java:43) at java.lang.reflect.Method.invoke(Method.java:502) at
com.carrotsearch.randomizedtesting.RandomizedRunner.invoke(RandomizedRunner.java:1627) at
com.carrotsearch.randomizedtesting.RandomizedRunner$6.evaluate(RandomizedRunner.java:836) at
com.carrotsearch.randomizedtesting.RandomizedRunner$7.evaluate(RandomizedRunner.java:872) at
com.carrotsearch.randomizedtesting.RandomizedRunner$8.evaluate(RandomizedRunner.java:886) at
org.apache.lucene.util.TestRuleSetupTeardownChained$1.evaluate(TestRuleSetupTeardownChained.java:50) at
org.apache.lucene.util.AbstractBeforeAfterRule$1.evaluate(AbstractBeforeAfterRule.java:46) at
org.apache.lucene.util.TestRuleThreadAndTestName$1.evaluate(TestRuleThreadAndTestName.java:49) at
org.apache.lucene.util.TestRuleIgnoreAfterMaxFailures$1.evaluate(TestRuleIgnoreAfterMaxFailures.java:65) at
org.apache.lucene.util.TestRuleMarkFailure$1.evaluate(TestRuleMarkFailure.java:48) at
com.carrotsearch.randomizedtesting.rules.StatementAdapter.evaluate(StatementAdapter.java:36) at
com.carrotsearch.randomizedtesting.ThreadLeakControl$StatementRunner.run(ThreadLeakControl.java:365) at
com.carrotsearch.randomizedtesting.ThreadLeakControl.forkTimeoutingTask(ThreadLeakControl.java:798) at
com.carrotsearch.randomizedtesting.ThreadLeakControl$3.evaluate(ThreadLeakControl.java:458) at
com.carrotsearch.randomizedtesting.RandomizedRunner.runSingleTest(RandomizedRunner.java:845) at
com.carrotsearch.randomizedtesting.RandomizedRunner$3.evaluate(RandomizedRunner.java:747) at
com.carrotsearch.randomizedtesting.RandomizedRunner$4.evaluate(RandomizedRunner.java:781) at
com.carrotsearch.randomizedtesting.RandomizedRunner$5.evaluate(RandomizedRunner.java:792) at
org.apache.lucene.util.AbstractBeforeAfterRule$1.evaluate(AbstractBeforeAfterRule.java:46) at
com.carrotsearch.randomizedtesting.rules.StatementAdapter.evaluate(StatementAdapter.java:36) at
org.apache.lucene.util.TestRuleStoreClassName$1.evaluate(TestRuleStoreClassName.java:42) at
com.carrotsearch.randomizedtesting.rules.NoShadowingOrOverridesOnMethodsRule$1.evaluate(NoShadowingOrOverridesOnMethodsRule.java:39) at
com.carrotsearch.randomizedtesting.rules.NoShadowingOrOverridesOnMethodsRule$1.evaluate(NoShadowingOrOverridesOnMethodsRule.java:39) at
com.carrotsearch.randomizedtesting.rules.StatementAdapter.evaluate(StatementAdapter.java:36) at
com.carrotsearch.randomizedtesting.rules.StatementAdapter.evaluate(StatementAdapter.java:36) at
com.carrotsearch.randomizedtesting.rules.StatementAdapter.evaluate(StatementAdapter.java:36) at
org.apache.lucene.util.TestRuleAssertionsRequired$1.evaluate(TestRuleAssertionsRequired.java:54) at
org.apache.lucene.util.TestRuleMarkFailure$1.evaluate(TestRuleMarkFailure.java:48) at
org.apache.lucene.util.TestRuleIgnoreAfterMaxFailures$1.evaluate(TestRuleIgnoreAfterMaxFailures.java:65) at
org.apache.lucene.util.TestRuleIgnoreTestSuites$1.evaluate(TestRuleIgnoreTestSuites.java:55) at
com.carrotsearch.randomizedtesting.rules.StatementAdapter.evaluate(StatementAdapter.java:36) at
com.carrotsearch.randomizedtesting.ThreadLeakControl$StatementRunner.run(ThreadLeakControl.java:365) at java.lang.Thread.run(Thread.java:745)

FAILED: org.apache.lucene.index.TestDocsAndPositions.testLargeNumberOfPositions

Error Message: expected:<500> but was:<271>

Stack Trace: java.lang.AssertionError: expected:<500> but was:<271> at
__randomizedtesting.SeedInfo.seed([721798422A6325A1:F446EAC27B41D5F1]:0) at org.junit.Assert.fail(Assert.java:93) at org.junit.Assert.failNotEquals(Assert.java:647) at org.junit.Assert.assertEquals(Assert.java:128) at org.junit.Assert.assertEquals(Assert.java:472) at org.junit.Assert.assertEquals(Assert.java:456) at
org.apache.lucene.index.TestDocsAndPositions.testLargeNumberOfPositions(TestDocsAndPositions.java:319) at sun.reflect.NativeMethodAccessorImpl.invoke0(Native Method) at
sun.reflect.NativeMethodAccessorImpl.invoke(NativeMethodAccessorImpl.java:62) at
sun.reflect.DelegatingMethodAccessorImpl.invoke(DelegatingMethodAccessorImpl.java:43) at java.lang.reflect.Method.invoke(Method.java:502) at
com.carrotsearch.randomizedtesting.RandomizedRunner.invoke(RandomizedRunner.java:1627) at
com.carrotsearch.randomizedtesting.RandomizedRunner$6.evaluate(RandomizedRunner.java:836) at
com.carrotsearch.randomizedtesting.RandomizedRunner$7.evaluate(RandomizedRunner.java:872) at
com.carrotsearch.randomizedtesting.RandomizedRunner$8.evaluate(RandomizedRunner.java:886) at
org.apache.lucene.util.TestRuleSetupTeardownChained$1.evaluate(TestRuleSetupTeardownChained.java:50) at
org.apache.lucene.util.AbstractBeforeAfterRule$1.evaluate(AbstractBeforeAfterRule.java:46) at
org.apache.lucene.util.TestRuleThreadAndTestName$1.evaluate(TestRuleThreadAndTestName.java:49) at
org.apache.lucene.util.TestRuleIgnoreAfterMaxFailures$1.evaluate(TestRuleIgnoreAfterMaxFailures.java:65) at
org.apache.lucene.util.TestRuleMarkFailure$1.evaluate(TestRuleMarkFailure.java:48) at
com.carrotsearch.randomizedtesting.rules.StatementAdapter.evaluate(StatementAdapter.java:36) at
com.carrotsearch.randomizedtesting.ThreadLeakControl$StatementRunner.run(ThreadLeakControl.java:365) at
com.carrotsearch.randomizedtesting.ThreadLeakControl.forkTimeoutingTask(ThreadLeakControl.java:798) at
com.carrotsearch.randomizedtesting.ThreadLeakControl$3.evaluate(ThreadLeakControl.java:458) at
com.carrotsearch.randomizedtesting.RandomizedRunner.runSingleTest(RandomizedRunner.java:845) at
com.carrotsearch.randomizedtesting.RandomizedRunner$3.evaluate(RandomizedRunner.java:747) at
com.carrotsearch.randomizedtesting.RandomizedRunner$4.evaluate(RandomizedRunner.java:781) at
com.carrotsearch.randomizedtesting.RandomizedRunner$5.evaluate(RandomizedRunner.java:792) at
org.apache.lucene.util.AbstractBeforeAfterRule$1.evaluate(AbstractBeforeAfterRule.java:46) at
com.carrotsearch.randomizedtesting.rules.StatementAdapter.evaluate(StatementAdapter.java:36) at
org.apache.lucene.util.TestRuleStoreClassName$1.evaluate(TestRuleStoreClassName.java:42) at
com.carrotsearch.randomizedtesting.rules.NoShadowingOrOverridesOnMethodsRule$1.evaluate(NoShadowingOrOverridesOnMethodsRule.java:39) at
com.carrotsearch.randomizedtesting.rules.NoShadowingOrOverridesOnMethodsRule$1.evaluate(NoShadowingOrOverridesOnMethodsRule.java:39) at
com.carrotsearch.randomizedtesting.rules.StatementAdapter.evaluate(StatementAdapter.java:36) at
com.carrotsearch.randomizedtesting.rules.StatementAdapter.evaluate(StatementAdapter.java:36) at
com.carrotsearch.randomizedtesting.rules.StatementAdapter.evaluate(StatementAdapter.java:36) at
org.apache.lucene.util.TestRuleAssertionsRequired$1.evaluate(TestRuleAssertionsRequired.java:54) at
org.apache.lucene.util.TestRuleMarkFailure$1.evaluate(TestRuleMarkFailure.java:48) at
org.apache.lucene.util.TestRuleIgnoreAfterMaxFailures$1.evaluate(TestRuleIgnoreAfterMaxFailures.java:65) at
org.apache.lucene.util.TestRuleIgnoreTestSuites$1.evaluate(TestRuleIgnoreTestSuites.java:55) at
com.carrotsearch.randomizedtesting.rules.StatementAdapter.evaluate(StatementAdapter.java:36) at
com.carrotsearch.randomizedtesting.ThreadLeakControl$StatementRunner.run(ThreadLeakControl.java:365) at java.lang.Thread.run(Thread.java:745)

FAILED: org.apache.lucene.index.TestDocsAndPositions.testRandomPositions

Error Message: iteration: 0 initDoc: 0 doc: 0 base: 0 positions: [435] expected:<435> but
was:<391>

Stack Trace: java.lang.AssertionError: iteration: 0 initDoc: 0 doc: 0 base: 0 positions:
[435] expected:<435> but was:<391> at
__randomizedtesting.SeedInfo.seed([721798422A6325A1:C33E17779C90868]:0) at org.junit.Assert.fail(Assert.java:93) at org.junit.Assert.failNotEquals(Assert.java:647) at org.junit.Assert.assertEquals(Assert.java:128) at org.junit.Assert.assertEquals(Assert.java:472) at
org.apache.lucene.index.TestDocsAndPositions.testRandomPositions(TestDocsAndPositions.java:175) at sun.reflect.NativeMethodAccessorImpl.invoke0(Native Method) at
sun.reflect.NativeMethodAccessorImpl.invoke(NativeMethodAccessorImpl.java:62) at
sun.reflect.DelegatingMethodAccessorImpl.invoke(DelegatingMethodAccessorImpl.java:43) at java.lang.reflect.Method.invoke(Method.java:502) at
com.carrotsearch.randomizedtesting.RandomizedRunner.invoke(RandomizedRunner.java:1627) at
com.carrotsearch.randomizedtesting.RandomizedRunner$6.evaluate(RandomizedRunner.java:836) at
com.carrotsearch.randomizedtesting.RandomizedRunner$7.evaluate(RandomizedRunner.java:872) at
com.carrotsearch.randomizedtesting.RandomizedRunner$8.evaluate(RandomizedRunner.java:886) at
org.apache.lucene.util.TestRuleSetupTeardownChained$1.evaluate(TestRuleSetupTeardownChained.java:50) at
org.apache.lucene.util.AbstractBeforeAfterRule$1.evaluate(AbstractBeforeAfterRule.java:46) at
org.apache.lucene.util.TestRuleThreadAndTestName$1.evaluate(TestRuleThreadAndTestName.java:49) at
org.apache.lucene.util.TestRuleIgnoreAfterMaxFailures$1.evaluate(TestRuleIgnoreAfterMaxFailures.java:65) at
org.apache.lucene.util.TestRuleMarkFailure$1.evaluate(TestRuleMarkFailure.java:48) at
com.carrotsearch.randomizedtesting.rules.StatementAdapter.evaluate(StatementAdapter.java:36) at
com.carrotsearch.randomizedtesting.ThreadLeakControl$StatementRunner.run(ThreadLeakControl.java:365) at
com.carrotsearch.randomizedtesting.ThreadLeakControl.forkTimeoutingTask(ThreadLeakControl.java:798) at
com.carrotsearch.randomizedtesting.ThreadLeakControl$3.evaluate(ThreadLeakControl.java:458) at
com.carrotsearch.randomizedtesting.RandomizedRunner.runSingleTest(RandomizedRunner.java:845) at
com.carrotsearch.randomizedtesting.RandomizedRunner$3.evaluate(RandomizedRunner.java:747) at
com.carrotsearch.randomizedtesting.RandomizedRunner$4.evaluate(RandomizedRunner.java:781) at
com.carrotsearch.randomizedtesting.RandomizedRunner$5.evaluate(RandomizedRunner.java:792) at
org.apache.lucene.util.AbstractBeforeAfterRule$1.evaluate(AbstractBeforeAfterRule.java:46) at
com.carrotsearch.randomizedtesting.rules.StatementAdapter.evaluate(StatementAdapter.java:36) at
org.apache.lucene.util.TestRuleStoreClassName$1.evaluate(TestRuleStoreClassName.java:42) at
com.carrotsearch.randomizedtesting.rules.NoShadowingOrOverridesOnMethodsRule$1.evaluate(NoShadowingOrOverridesOnMethodsRule.java:39) at
com.carrotsearch.randomizedtesting.rules.NoShadowingOrOverridesOnMethodsRule$1.evaluate(NoShadowingOrOverridesOnMethodsRule.java:39) at
com.carrotsearch.randomizedtesting.rules.StatementAdapter.evaluate(StatementAdapter.java:36) at
com.carrotsearch.randomizedtesting.rules.StatementAdapter.evaluate(StatementAdapter.java:36) at
com.carrotsearch.randomizedtesting.rules.StatementAdapter.evaluate(StatementAdapter.java:36) at
org.apache.lucene.util.TestRuleAssertionsRequired$1.evaluate(TestRuleAssertionsRequired.java:54) at
org.apache.lucene.util.TestRuleMarkFailure$1.evaluate(TestRuleMarkFailure.java:48) at
org.apache.lucene.util.TestRuleIgnoreAfterMaxFailures$1.evaluate(TestRuleIgnoreAfterMaxFailures.java:65) at
org.apache.lucene.util.TestRuleIgnoreTestSuites$1.evaluate(TestRuleIgnoreTestSuites.java:55) at
com.carrotsearch.randomizedtesting.rules.StatementAdapter.evaluate(StatementAdapter.java:36) at
com.carrotsearch.randomizedtesting.ThreadLeakControl$StatementRunner.run(ThreadLeakControl.java:365) at java.lang.Thread.run(Thread.java:745)

FAILED: org.apache.lucene.index.TestDocsAndPositions.testPositionsSimple

Error Message: Advanced to: 5 current doc: 5 expected:<4> but was:<3>

Stack Trace: java.lang.AssertionError: Advanced to: 5 current doc: 5 expected:<4> but was:<3> at
__randomizedtesting.SeedInfo.seed([721798422A6325A1:7E10464C3EDDC44A]:0) at org.junit.Assert.fail(Assert.java:93) at org.junit.Assert.failNotEquals(Assert.java:647) at org.junit.Assert.assertEquals(Assert.java:128) at org.junit.Assert.assertEquals(Assert.java:472) at
org.apache.lucene.index.TestDocsAndPositions.testPositionsSimple(TestDocsAndPositions.java:78) at sun.reflect.NativeMethodAccessorImpl.invoke0(Native Method) at
sun.reflect.NativeMethodAccessorImpl.invoke(NativeMethodAccessorImpl.java:62) at
sun.reflect.DelegatingMethodAccessorImpl.invoke(DelegatingMethodAccessorImpl.java:43) at java.lang.reflect.Method.invoke(Method.java:502) at
com.carrotsearch.randomizedtesting.RandomizedRunner.invoke(RandomizedRunner.java:1627) at
com.carrotsearch.randomizedtesting.RandomizedRunner$6.evaluate(RandomizedRunner.java:836) at
com.carrotsearch.randomizedtesting.RandomizedRunner$7.evaluate(RandomizedRunner.java:872) at
com.carrotsearch.randomizedtesting.RandomizedRunner$8.evaluate(RandomizedRunner.java:886) at
org.apache.lucene.util.TestRuleSetupTeardownChained$1.evaluate(TestRuleSetupTeardownChained.java:50) at
org.apache.lucene.util.AbstractBeforeAfterRule$1.evaluate(AbstractBeforeAfterRule.java:46) at
org.apache.lucene.util.TestRuleThreadAndTestName$1.evaluate(TestRuleThreadAndTestName.java:49) at
org.apache.lucene.util.TestRuleIgnoreAfterMaxFailures$1.evaluate(TestRuleIgnoreAfterMaxFailures.java:65) at
org.apache.lucene.util.TestRuleMarkFailure$1.evaluate(TestRuleMarkFailure.java:48) at
com.carrotsearch.randomizedtesting.rules.StatementAdapter.evaluate(StatementAdapter.java:36) at
com.carrotsearch.randomizedtesting.ThreadLeakControl$StatementRunner.run(ThreadLeakControl.java:365) at
com.carrotsearch.randomizedtesting.ThreadLeakControl.forkTimeoutingTask(ThreadLeakControl.java:798) at
com.carrotsearch.randomizedtesting.ThreadLeakControl$3.evaluate(ThreadLeakControl.java:458) at
com.carrotsearch.randomizedtesting.RandomizedRunner.runSingleTest(RandomizedRunner.java:845) at
com.carrotsearch.randomizedtesting.RandomizedRunner$3.evaluate(RandomizedRunner.java:747) at
com.carrotsearch.randomizedtesting.RandomizedRunner$4.evaluate(RandomizedRunner.java:781) at
com.carrotsearch.randomizedtesting.RandomizedRunner$5.evaluate(RandomizedRunner.java:792) at
org.apache.lucene.util.AbstractBeforeAfterRule$1.evaluate(AbstractBeforeAfterRule.java:46) at
com.carrotsearch.randomizedtesting.rules.StatementAdapter.evaluate(StatementAdapter.java:36) at
org.apache.lucene.util.TestRuleStoreClassName$1.evaluate(TestRuleStoreClassName.java:42) at
com.carrotsearch.randomizedtesting.rules.NoShadowingOrOverridesOnMethodsRule$1.evaluate(NoShadowingOrOverridesOnMethodsRule.java:39) at
com.carrotsearch.randomizedtesting.rules.NoShadowingOrOverridesOnMethodsRule$1.evaluate(NoShadowingOrOverridesOnMethodsRule.java:39) at
com.carrotsearch.randomizedtesting.rules.StatementAdapter.evaluate(StatementAdapter.java:36) at
com.carrotsearch.randomizedtesting.rules.StatementAdapter.evaluate(StatementAdapter.java:36) at
com.carrotsearch.randomizedtesting.rules.StatementAdapter.evaluate(StatementAdapter.java:36) at
org.apache.lucene.util.TestRuleAssertionsRequired$1.evaluate(TestRuleAssertionsRequired.java:54) at
org.apache.lucene.util.TestRuleMarkFailure$1.evaluate(TestRuleMarkFailure.java:48) at
org.apache.lucene.util.TestRuleIgnoreAfterMaxFailures$1.evaluate(TestRuleIgnoreAfterMaxFailures.java:65) at
org.apache.lucene.util.TestRuleIgnoreTestSuites$1.evaluate(TestRuleIgnoreTestSuites.java:55) at
com.carrotsearch.randomizedtesting.rules.StatementAdapter.evaluate(StatementAdapter.java:36) at
com.carrotsearch.randomizedtesting.ThreadLeakControl$StatementRunner.run(ThreadLeakControl.java:365) at java.lang.Thread.run(Thread.java:745)

FAILED: org.apache.lucene.index.TestForTooMuchCloning.test

Error Message: unpaired low surrogate: df75

Stack Trace: java.lang.IllegalStateException: unpaired low surrogate: df75 at
__randomizedtesting.SeedInfo.seed([721798422A6325A1:FA43A798849F4859]:0) at
org.apache.lucene.analysis.MockTokenizer.failAlways(MockTokenizer.java:131) at
org.apache.lucene.analysis.MockTokenizer.readCodePoint(MockTokenizer.java:208) at
org.apache.lucene.analysis.MockTokenizer.incrementToken(MockTokenizer.java:164) at
org.apache.lucene.analysis.MockTokenFilter.incrementToken(MockTokenFilter.java:81) at
org.apache.lucene.index.DefaultIndexingChain$PerField.invert(DefaultIndexingChain.java:601) at
org.apache.lucene.index.DefaultIndexingChain.processDocument(DefaultIndexingChain.java:306) at
org.apache.lucene.index.DocumentsWriterPerThread.updateDocument(DocumentsWriterPerThread.java:234) at
org.apache.lucene.index.DocumentsWriter.updateDocument(DocumentsWriter.java:455) at
org.apache.lucene.index.IndexWriter.updateDocument(IndexWriter.java:1458) at
org.apache.lucene.index.IndexWriter.addDocument(IndexWriter.java:1237) at
org.apache.lucene.index.RandomIndexWriter.addDocument(RandomIndexWriter.java:173) at
org.apache.lucene.index.TestForTooMuchCloning.test(TestForTooMuchCloning.java:53) at sun.reflect.NativeMethodAccessorImpl.invoke0(Native Method) at
sun.reflect.NativeMethodAccessorImpl.invoke(NativeMethodAccessorImpl.java:62) at
sun.reflect.DelegatingMethodAccessorImpl.invoke(DelegatingMethodAccessorImpl.java:43) at java.lang.reflect.Method.invoke(Method.java:502) at
com.carrotsearch.randomizedtesting.RandomizedRunner.invoke(RandomizedRunner.java:1627) at
com.carrotsearch.randomizedtesting.RandomizedRunner$6.evaluate(RandomizedRunner.java:836) at
com.carrotsearch.randomizedtesting.RandomizedRunner$7.evaluate(RandomizedRunner.java:872) at
com.carrotsearch.randomizedtesting.RandomizedRunner$8.evaluate(RandomizedRunner.java:886) at
org.apache.lucene.util.TestRuleSetupTeardownChained$1.evaluate(TestRuleSetupTeardownChained.java:50) at
org.apache.lucene.util.AbstractBeforeAfterRule$1.evaluate(AbstractBeforeAfterRule.java:46) at
org.apache.lucene.util.TestRuleThreadAndTestName$1.evaluate(TestRuleThreadAndTestName.java:49) at
org.apache.lucene.util.TestRuleIgnoreAfterMaxFailures$1.evaluate(TestRuleIgnoreAfterMaxFailures.java:65) at
org.apache.lucene.util.TestRuleMarkFailure$1.evaluate(TestRuleMarkFailure.java:48) at
com.carrotsearch.randomizedtesting.rules.StatementAdapter.evaluate(StatementAdapter.java:36) at
com.carrotsearch.randomizedtesting.ThreadLeakControl$StatementRunner.run(ThreadLeakControl.java:365) at
com.carrotsearch.randomizedtesting.ThreadLeakControl.forkTimeoutingTask(ThreadLeakControl.java:798) at
com.carrotsearch.randomizedtesting.ThreadLeakControl$3.evaluate(ThreadLeakControl.java:458) at
com.carrotsearch.randomizedtesting.RandomizedRunner.runSingleTest(RandomizedRunner.java:845) at
com.carrotsearch.randomizedtesting.RandomizedRunner$3.evaluate(RandomizedRunner.java:747) at
com.carrotsearch.randomizedtesting.RandomizedRunner$4.evaluate(RandomizedRunner.java:781) at
com.carrotsearch.randomizedtesting.RandomizedRunner$5.evaluate(RandomizedRunner.java:792) at
org.apache.lucene.util.AbstractBeforeAfterRule$1.evaluate(AbstractBeforeAfterRule.java:46) at
com.carrotsearch.randomizedtesting.rules.StatementAdapter.evaluate(StatementAdapter.java:36) at
org.apache.lucene.util.TestRuleStoreClassName$1.evaluate(TestRuleStoreClassName.java:42) at
com.carrotsearch.randomizedtesting.rules.NoShadowingOrOverridesOnMethodsRule$1.evaluate(NoShadowingOrOverridesOnMethodsRule.java:39) at
com.carrotsearch.randomizedtesting.rules.NoShadowingOrOverridesOnMethodsRule$1.evaluate(NoShadowingOrOverridesOnMethodsRule.java:39) at
com.carrotsearch.randomizedtesting.rules.StatementAdapter.evaluate(StatementAdapter.java:36) at
com.carrotsearch.randomizedtesting.rules.StatementAdapter.evaluate(StatementAdapter.java:36) at
com.carrotsearch.randomizedtesting.rules.StatementAdapter.evaluate(StatementAdapter.java:36) at
org.apache.lucene.util.TestRuleAssertionsRequired$1.evaluate(TestRuleAssertionsRequired.java:54) at
org.apache.lucene.util.TestRuleMarkFailure$1.evaluate(TestRuleMarkFailure.java:48) at
org.apache.lucene.util.TestRuleIgnoreAfterMaxFailures$1.evaluate(TestRuleIgnoreAfterMaxFailures.java:65) at
org.apache.lucene.util.TestRuleIgnoreTestSuites$1.evaluate(TestRuleIgnoreTestSuites.java:55) at
com.carrotsearch.randomizedtesting.rules.StatementAdapter.evaluate(StatementAdapter.java:36) at
com.carrotsearch.randomizedtesting.ThreadLeakControl$StatementRunner.run(ThreadLeakControl.java:365) at java.lang.Thread.run(Thread.java:745) Suppressed: java.lang.IllegalStateException: close() called in wrong
state: INCREMENT at
org.apache.lucene.analysis.MockTokenizer.fail(MockTokenizer.java:126) at
org.apache.lucene.analysis.MockTokenizer.close(MockTokenizer.java:293) at
org.apache.lucene.analysis.TokenFilter.close(TokenFilter.java:58) at
org.apache.lucene.index.DefaultIndexingChain$PerField.invert(DefaultIndexingChain.java:675) ... 43 more

FAILED: org.apache.lucene.index.TestIndexWriterCommit.testCommitOnClose

Error Message: first number of hits expected:<14> but was:<13>

Stack Trace: java.lang.AssertionError: first number of hits expected:<14> but was:<13> at
__randomizedtesting.SeedInfo.seed([721798422A6325A1:54550CDC7C4BB08D]:0) at org.junit.Assert.fail(Assert.java:93) at org.junit.Assert.failNotEquals(Assert.java:647) at org.junit.Assert.assertEquals(Assert.java:128) at org.junit.Assert.assertEquals(Assert.java:472) at
org.apache.lucene.index.TestIndexWriterCommit.testCommitOnClose(TestIndexWriterCommit.java:56) at sun.reflect.NativeMethodAccessorImpl.invoke0(Native Method) at
sun.reflect.NativeMethodAccessorImpl.invoke(NativeMethodAccessorImpl.java:62) at
sun.reflect.DelegatingMethodAccessorImpl.invoke(DelegatingMethodAccessorImpl.java:43) at java.lang.reflect.Method.invoke(Method.java:502) at
com.carrotsearch.randomizedtesting.RandomizedRunner.invoke(RandomizedRunner.java:1627) at
com.carrotsearch.randomizedtesting.RandomizedRunner$6.evaluate(RandomizedRunner.java:836) at
com.carrotsearch.randomizedtesting.RandomizedRunner$7.evaluate(RandomizedRunner.java:872) at
com.carrotsearch.randomizedtesting.RandomizedRunner$8.evaluate(RandomizedRunner.java:886) at
org.apache.lucene.util.TestRuleSetupTeardownChained$1.evaluate(TestRuleSetupTeardownChained.java:50) at
org.apache.lucene.util.AbstractBeforeAfterRule$1.evaluate(AbstractBeforeAfterRule.java:46) at
org.apache.lucene.util.TestRuleThreadAndTestName$1.evaluate(TestRuleThreadAndTestName.java:49) at
org.apache.lucene.util.TestRuleIgnoreAfterMaxFailures$1.evaluate(TestRuleIgnoreAfterMaxFailures.java:65) at
org.apache.lucene.util.TestRuleMarkFailure$1.evaluate(TestRuleMarkFailure.java:48) at
com.carrotsearch.randomizedtesting.rules.StatementAdapter.evaluate(StatementAdapter.java:36) at
com.carrotsearch.randomizedtesting.ThreadLeakControl$StatementRunner.run(ThreadLeakControl.java:365) at
com.carrotsearch.randomizedtesting.ThreadLeakControl.forkTimeoutingTask(ThreadLeakControl.java:798) at
com.carrotsearch.randomizedtesting.ThreadLeakControl$3.evaluate(ThreadLeakControl.java:458) at
com.carrotsearch.randomizedtesting.RandomizedRunner.runSingleTest(RandomizedRunner.java:845) at
com.carrotsearch.randomizedtesting.RandomizedRunner$3.evaluate(RandomizedRunner.java:747) at
com.carrotsearch.randomizedtesting.RandomizedRunner$4.evaluate(RandomizedRunner.java:781) at
com.carrotsearch.randomizedtesting.RandomizedRunner$5.evaluate(RandomizedRunner.java:792) at
org.apache.lucene.util.AbstractBeforeAfterRule$1.evaluate(AbstractBeforeAfterRule.java:46) at
com.carrotsearch.randomizedtesting.rules.StatementAdapter.evaluate(StatementAdapter.java:36) at
org.apache.lucene.util.TestRuleStoreClassName$1.evaluate(TestRuleStoreClassName.java:42) at
com.carrotsearch.randomizedtesting.rules.NoShadowingOrOverridesOnMethodsRule$1.evaluate(NoShadowingOrOverridesOnMethodsRule.java:39) at
com.carrotsearch.randomizedtesting.rules.NoShadowingOrOverridesOnMethodsRule$1.evaluate(NoShadowingOrOverridesOnMethodsRule.java:39) at
com.carrotsearch.randomizedtesting.rules.StatementAdapter.evaluate(StatementAdapter.java:36) at
com.carrotsearch.randomizedtesting.rules.StatementAdapter.evaluate(StatementAdapter.java:36) at
com.carrotsearch.randomizedtesting.rules.StatementAdapter.evaluate(StatementAdapter.java:36) at
org.apache.lucene.util.TestRuleAssertionsRequired$1.evaluate(TestRuleAssertionsRequired.java:54) at
org.apache.lucene.util.TestRuleMarkFailure$1.evaluate(TestRuleMarkFailure.java:48) at
org.apache.lucene.util.TestRuleIgnoreAfterMaxFailures$1.evaluate(TestRuleIgnoreAfterMaxFailures.java:65) at
org.apache.lucene.util.TestRuleIgnoreTestSuites$1.evaluate(TestRuleIgnoreTestSuites.java:55) at
com.carrotsearch.randomizedtesting.rules.StatementAdapter.evaluate(StatementAdapter.java:36) at
com.carrotsearch.randomizedtesting.ThreadLeakControl$StatementRunner.run(ThreadLeakControl.java:365) at java.lang.Thread.run(Thread.java:745)

FAILED: org.apache.lucene.index.TestIndexWriterCommit.testCommitOnCloseAbort

Error Message: first number of hits expected:<14> but was:<10>

Stack Trace: java.lang.AssertionError: first number of hits expected:<14> but was:<10> at
__randomizedtesting.SeedInfo.seed([721798422A6325A1:6191D0C505586956]:0) at org.junit.Assert.fail(Assert.java:93) at org.junit.Assert.failNotEquals(Assert.java:647) at org.junit.Assert.assertEquals(Assert.java:128) at org.junit.Assert.assertEquals(Assert.java:472) at
org.apache.lucene.index.TestIndexWriterCommit.testCommitOnCloseAbort(TestIndexWriterCommit.java:112) at sun.reflect.NativeMethodAccessorImpl.invoke0(Native Method) at
sun.reflect.NativeMethodAccessorImpl.invoke(NativeMethodAccessorImpl.java:62) at
sun.reflect.DelegatingMethodAccessorImpl.invoke(DelegatingMethodAccessorImpl.java:43) at java.lang.reflect.Method.invoke(Method.java:502) at
com.carrotsearch.randomizedtesting.RandomizedRunner.invoke(RandomizedRunner.java:1627) at
com.carrotsearch.randomizedtesting.RandomizedRunner$6.evaluate(RandomizedRunner.java:836) at
com.carrotsearch.randomizedtesting.RandomizedRunner$7.evaluate(RandomizedRunner.java:872) at
com.carrotsearch.randomizedtesting.RandomizedRunner$8.evaluate(RandomizedRunner.java:886) at
org.apache.lucene.util.TestRuleSetupTeardownChained$1.evaluate(TestRuleSetupTeardownChained.java:50) at
org.apache.lucene.util.AbstractBeforeAfterRule$1.evaluate(AbstractBeforeAfterRule.java:46) at
org.apache.lucene.util.TestRuleThreadAndTestName$1.evaluate(TestRuleThreadAndTestName.java:49) at
org.apache.lucene.util.TestRuleIgnoreAfterMaxFailures$1.evaluate(TestRuleIgnoreAfterMaxFailures.java:65) at
org.apache.lucene.util.TestRuleMarkFailure$1.evaluate(TestRuleMarkFailure.java:48) at
com.carrotsearch.randomizedtesting.rules.StatementAdapter.evaluate(StatementAdapter.java:36) at
com.carrotsearch.randomizedtesting.ThreadLeakControl$StatementRunner.run(ThreadLeakControl.java:365) at
com.carrotsearch.randomizedtesting.ThreadLeakControl.forkTimeoutingTask(ThreadLeakControl.java:798) at
com.carrotsearch.randomizedtesting.ThreadLeakControl$3.evaluate(ThreadLeakControl.java:458) at
com.carrotsearch.randomizedtesting.RandomizedRunner.runSingleTest(RandomizedRunner.java:845) at
com.carrotsearch.randomizedtesting.RandomizedRunner$3.evaluate(RandomizedRunner.java:747) at
com.carrotsearch.randomizedtesting.RandomizedRunner$4.evaluate(RandomizedRunner.java:781) at
com.carrotsearch.randomizedtesting.RandomizedRunner$5.evaluate(RandomizedRunner.java:792) at
org.apache.lucene.util.AbstractBeforeAfterRule$1.evaluate(AbstractBeforeAfterRule.java:46) at
com.carrotsearch.randomizedtesting.rules.StatementAdapter.evaluate(StatementAdapter.java:36) at
org.apache.lucene.util.TestRuleStoreClassName$1.evaluate(TestRuleStoreClassName.java:42) at
com.carrotsearch.randomizedtesting.rules.NoShadowingOrOverridesOnMethodsRule$1.evaluate(NoShadowingOrOverridesOnMethodsRule.java:39) at
com.carrotsearch.randomizedtesting.rules.NoShadowingOrOverridesOnMethodsRule$1.evaluate(NoShadowingOrOverridesOnMethodsRule.java:39) at
com.carrotsearch.randomizedtesting.rules.StatementAdapter.evaluate(StatementAdapter.java:36) at
com.carrotsearch.randomizedtesting.rules.StatementAdapter.evaluate(StatementAdapter.java:36) at
com.carrotsearch.randomizedtesting.rules.StatementAdapter.evaluate(StatementAdapter.java:36) at
org.apache.lucene.util.TestRuleAssertionsRequired$1.evaluate(TestRuleAssertionsRequired.java:54) at
org.apache.lucene.util.TestRuleMarkFailure$1.evaluate(TestRuleMarkFailure.java:48) at
org.apache.lucene.util.TestRuleIgnoreAfterMaxFailures$1.evaluate(TestRuleIgnoreAfterMaxFailures.java:65) at
org.apache.lucene.util.TestRuleIgnoreTestSuites$1.evaluate(TestRuleIgnoreTestSuites.java:55) at
com.carrotsearch.randomizedtesting.rules.StatementAdapter.evaluate(StatementAdapter.java:36) at
com.carrotsearch.randomizedtesting.ThreadLeakControl$StatementRunner.run(ThreadLeakControl.java:365) at java.lang.Thread.run(Thread.java:745)

FAILED: org.apache.lucene.index.TestIndexWriterDelete.testSimpleCase

Error Message: expected:<1> but was:<0>

Stack Trace: java.lang.AssertionError: expected:<1> but was:<0> at
__randomizedtesting.SeedInfo.seed([721798422A6325A1:59D464E4DCDB6E2F]:0) at org.junit.Assert.fail(Assert.java:93) at org.junit.Assert.failNotEquals(Assert.java:647) at org.junit.Assert.assertEquals(Assert.java:128) at org.junit.Assert.assertEquals(Assert.java:472) at org.junit.Assert.assertEquals(Assert.java:456) at
org.apache.lucene.index.TestIndexWriterDelete.testSimpleCase(TestIndexWriterDelete.java:80) at sun.reflect.NativeMethodAccessorImpl.invoke0(Native Method) at
sun.reflect.NativeMethodAccessorImpl.invoke(NativeMethodAccessorImpl.java:62) at
sun.reflect.DelegatingMethodAccessorImpl.invoke(DelegatingMethodAccessorImpl.java:43) at java.lang.reflect.Method.invoke(Method.java:502) at
com.carrotsearch.randomizedtesting.RandomizedRunner.invoke(RandomizedRunner.java:1627) at
com.carrotsearch.randomizedtesting.RandomizedRunner$6.evaluate(RandomizedRunner.java:836) at
com.carrotsearch.randomizedtesting.RandomizedRunner$7.evaluate(RandomizedRunner.java:872) at
com.carrotsearch.randomizedtesting.RandomizedRunner$8.evaluate(RandomizedRunner.java:886) at
org.apache.lucene.util.TestRuleSetupTeardownChained$1.evaluate(TestRuleSetupTeardownChained.java:50) at
org.apache.lucene.util.AbstractBeforeAfterRule$1.evaluate(AbstractBeforeAfterRule.java:46) at
org.apache.lucene.util.TestRuleThreadAndTestName$1.evaluate(TestRuleThreadAndTestName.java:49) at
org.apache.lucene.util.TestRuleIgnoreAfterMaxFailures$1.evaluate(TestRuleIgnoreAfterMaxFailures.java:65) at
org.apache.lucene.util.TestRuleMarkFailure$1.evaluate(TestRuleMarkFailure.java:48) at
com.carrotsearch.randomizedtesting.rules.StatementAdapter.evaluate(StatementAdapter.java:36) at
com.carrotsearch.randomizedtesting.ThreadLeakControl$StatementRunner.run(ThreadLeakControl.java:365) at
com.carrotsearch.randomizedtesting.ThreadLeakControl.forkTimeoutingTask(ThreadLeakControl.java:798) at
com.carrotsearch.randomizedtesting.ThreadLeakControl$3.evaluate(ThreadLeakControl.java:458) at
com.carrotsearch.randomizedtesting.RandomizedRunner.runSingleTest(RandomizedRunner.java:845) at
com.carrotsearch.randomizedtesting.RandomizedRunner$3.evaluate(RandomizedRunner.java:747) at
com.carrotsearch.randomizedtesting.RandomizedRunner$4.evaluate(RandomizedRunner.java:781) at
com.carrotsearch.randomizedtesting.RandomizedRunner$5.evaluate(RandomizedRunner.java:792) at
org.apache.lucene.util.AbstractBeforeAfterRule$1.evaluate(AbstractBeforeAfterRule.java:46) at
com.carrotsearch.randomizedtesting.rules.StatementAdapter.evaluate(StatementAdapter.java:36) at
org.apache.lucene.util.TestRuleStoreClassName$1.evaluate(TestRuleStoreClassName.java:42) at
com.carrotsearch.randomizedtesting.rules.NoShadowingOrOverridesOnMethodsRule$1.evaluate(NoShadowingOrOverridesOnMethodsRule.java:39) at
com.carrotsearch.randomizedtesting.rules.NoShadowingOrOverridesOnMethodsRule$1.evaluate(NoShadowingOrOverridesOnMethodsRule.java:39) at
com.carrotsearch.randomizedtesting.rules.StatementAdapter.evaluate(StatementAdapter.java:36) at
com.carrotsearch.randomizedtesting.rules.StatementAdapter.evaluate(StatementAdapter.java:36) at
com.carrotsearch.randomizedtesting.rules.StatementAdapter.evaluate(StatementAdapter.java:36) at
org.apache.lucene.util.TestRuleAssertionsRequired$1.evaluate(TestRuleAssertionsRequired.java:54) at
org.apache.lucene.util.TestRuleMarkFailure$1.evaluate(TestRuleMarkFailure.java:48) at
org.apache.lucene.util.TestRuleIgnoreAfterMaxFailures$1.evaluate(TestRuleIgnoreAfterMaxFailures.java:65) at
org.apache.lucene.util.TestRuleIgnoreTestSuites$1.evaluate(TestRuleIgnoreTestSuites.java:55) at
com.carrotsearch.randomizedtesting.rules.StatementAdapter.evaluate(StatementAdapter.java:36) at
com.carrotsearch.randomizedtesting.ThreadLeakControl$StatementRunner.run(ThreadLeakControl.java:365) at java.lang.Thread.run(Thread.java:745)

FAILED: org.apache.lucene.index.TestIndexWriterDelete.testDeletesOnDiskFull

Error Message: disk full during reader.close() @ 19466 bytes: method did throw exception but
hits.length for search on term 'aaa' is 96 instead of expected 157 or 144

Stack Trace: java.lang.AssertionError: disk full during reader.close() @ 19466 bytes: method
did throw exception but hits.length for search on term 'aaa' is 96 instead of
expected 157 or 144 at
__randomizedtesting.SeedInfo.seed([721798422A6325A1:62ACA818ACEBBB4D]:0) at org.junit.Assert.fail(Assert.java:93) at
org.apache.lucene.index.TestIndexWriterDelete.doTestOperationsOnDiskFull(TestIndexWriterDelete.java:687) at
org.apache.lucene.index.TestIndexWriterDelete.testDeletesOnDiskFull(TestIndexWriterDelete.java:482) at sun.reflect.NativeMethodAccessorImpl.invoke0(Native Method) at
sun.reflect.NativeMethodAccessorImpl.invoke(NativeMethodAccessorImpl.java:62) at
sun.reflect.DelegatingMethodAccessorImpl.invoke(DelegatingMethodAccessorImpl.java:43) at java.lang.reflect.Method.invoke(Method.java:502) at
com.carrotsearch.randomizedtesting.RandomizedRunner.invoke(RandomizedRunner.java:1627) at
com.carrotsearch.randomizedtesting.RandomizedRunner$6.evaluate(RandomizedRunner.java:836) at
com.carrotsearch.randomizedtesting.RandomizedRunner$7.evaluate(RandomizedRunner.java:872) at
com.carrotsearch.randomizedtesting.RandomizedRunner$8.evaluate(RandomizedRunner.java:886) at
org.apache.lucene.util.TestRuleSetupTeardownChained$1.evaluate(TestRuleSetupTeardownChained.java:50) at
org.apache.lucene.util.AbstractBeforeAfterRule$1.evaluate(AbstractBeforeAfterRule.java:46) at
org.apache.lucene.util.TestRuleThreadAndTestName$1.evaluate(TestRuleThreadAndTestName.java:49) at
org.apache.lucene.util.TestRuleIgnoreAfterMaxFailures$1.evaluate(TestRuleIgnoreAfterMaxFailures.java:65) at
org.apache.lucene.util.TestRuleMarkFailure$1.evaluate(TestRuleMarkFailure.java:48) at
com.carrotsearch.randomizedtesting.rules.StatementAdapter.evaluate(StatementAdapter.java:36) at
com.carrotsearch.randomizedtesting.ThreadLeakControl$StatementRunner.run(ThreadLeakControl.java:365) at
com.carrotsearch.randomizedtesting.ThreadLeakControl.forkTimeoutingTask(ThreadLeakControl.java:798) at
com.carrotsearch.randomizedtesting.ThreadLeakControl$3.evaluate(ThreadLeakControl.java:458) at
com.carrotsearch.randomizedtesting.RandomizedRunner.runSingleTest(RandomizedRunner.java:845) at
com.carrotsearch.randomizedtesting.RandomizedRunner$3.evaluate(RandomizedRunner.java:747) at
com.carrotsearch.randomizedtesting.RandomizedRunner$4.evaluate(RandomizedRunner.java:781) at
com.carrotsearch.randomizedtesting.RandomizedRunner$5.evaluate(RandomizedRunner.java:792) at
org.apache.lucene.util.AbstractBeforeAfterRule$1.evaluate(AbstractBeforeAfterRule.java:46) at
com.carrotsearch.randomizedtesting.rules.StatementAdapter.evaluate(StatementAdapter.java:36) at
org.apache.lucene.util.TestRuleStoreClassName$1.evaluate(TestRuleStoreClassName.java:42) at
com.carrotsearch.randomizedtesting.rules.NoShadowingOrOverridesOnMethodsRule$1.evaluate(NoShadowingOrOverridesOnMethodsRule.java:39) at
com.carrotsearch.randomizedtesting.rules.NoShadowingOrOverridesOnMethodsRule$1.evaluate(NoShadowingOrOverridesOnMethodsRule.java:39) at
com.carrotsearch.randomizedtesting.rules.StatementAdapter.evaluate(StatementAdapter.java:36) at
com.carrotsearch.randomizedtesting.rules.StatementAdapter.evaluate(StatementAdapter.java:36) at
com.carrotsearch.randomizedtesting.rules.StatementAdapter.evaluate(StatementAdapter.java:36) at
org.apache.lucene.util.TestRuleAssertionsRequired$1.evaluate(TestRuleAssertionsRequired.java:54) at
org.apache.lucene.util.TestRuleMarkFailure$1.evaluate(TestRuleMarkFailure.java:48) at
org.apache.lucene.util.TestRuleIgnoreAfterMaxFailures$1.evaluate(TestRuleIgnoreAfterMaxFailures.java:65) at
org.apache.lucene.util.TestRuleIgnoreTestSuites$1.evaluate(TestRuleIgnoreTestSuites.java:55) at
com.carrotsearch.randomizedtesting.rules.StatementAdapter.evaluate(StatementAdapter.java:36) at
com.carrotsearch.randomizedtesting.ThreadLeakControl$StatementRunner.run(ThreadLeakControl.java:365) at java.lang.Thread.run(Thread.java:745)

FAILED: org.apache.lucene.index.TestIndexWriterDelete.testUpdatesOnDiskFull

Error Message: disk full during reader.close() @ 9226 bytes: method did throw exception but
hits.length for search on term 'aaa' is 113 instead of expected 157 or 144

Stack Trace: java.lang.AssertionError: disk full during reader.close() @ 9226 bytes: method
did throw exception but hits.length for search on term 'aaa' is 113 instead of
expected 157 or 144 at
__randomizedtesting.SeedInfo.seed([721798422A6325A1:16F15E718E698A07]:0) at org.junit.Assert.fail(Assert.java:93) at
org.apache.lucene.index.TestIndexWriterDelete.doTestOperationsOnDiskFull(TestIndexWriterDelete.java:687) at
org.apache.lucene.index.TestIndexWriterDelete.testUpdatesOnDiskFull(TestIndexWriterDelete.java:486) at sun.reflect.NativeMethodAccessorImpl.invoke0(Native Method) at
sun.reflect.NativeMethodAccessorImpl.invoke(NativeMethodAccessorImpl.java:62) at
sun.reflect.DelegatingMethodAccessorImpl.invoke(DelegatingMethodAccessorImpl.java:43) at java.lang.reflect.Method.invoke(Method.java:502) at
com.carrotsearch.randomizedtesting.RandomizedRunner.invoke(RandomizedRunner.java:1627) at
com.carrotsearch.randomizedtesting.RandomizedRunner$6.evaluate(RandomizedRunner.java:836) at
com.carrotsearch.randomizedtesting.RandomizedRunner$7.evaluate(RandomizedRunner.java:872) at
com.carrotsearch.randomizedtesting.RandomizedRunner$8.evaluate(RandomizedRunner.java:886) at
org.apache.lucene.util.TestRuleSetupTeardownChained$1.evaluate(TestRuleSetupTeardownChained.java:50) at
org.apache.lucene.util.AbstractBeforeAfterRule$1.evaluate(AbstractBeforeAfterRule.java:46) at
org.apache.lucene.util.TestRuleThreadAndTestName$1.evaluate(TestRuleThreadAndTestName.java:49) at
org.apache.lucene.util.TestRuleIgnoreAfterMaxFailures$1.evaluate(TestRuleIgnoreAfterMaxFailures.java:65) at
org.apache.lucene.util.TestRuleMarkFailure$1.evaluate(TestRuleMarkFailure.java:48) at
com.carrotsearch.randomizedtesting.rules.StatementAdapter.evaluate(StatementAdapter.java:36) at
com.carrotsearch.randomizedtesting.ThreadLeakControl$StatementRunner.run(ThreadLeakControl.java:365) at
com.carrotsearch.randomizedtesting.ThreadLeakControl.forkTimeoutingTask(ThreadLeakControl.java:798) at
com.carrotsearch.randomizedtesting.ThreadLeakControl$3.evaluate(ThreadLeakControl.java:458) at
com.carrotsearch.randomizedtesting.RandomizedRunner.runSingleTest(RandomizedRunner.java:845) at
com.carrotsearch.randomizedtesting.RandomizedRunner$3.evaluate(RandomizedRunner.java:747) at
com.carrotsearch.randomizedtesting.RandomizedRunner$4.evaluate(RandomizedRunner.java:781) at
com.carrotsearch.randomizedtesting.RandomizedRunner$5.evaluate(RandomizedRunner.java:792) at
org.apache.lucene.util.AbstractBeforeAfterRule$1.evaluate(AbstractBeforeAfterRule.java:46) at
com.carrotsearch.randomizedtesting.rules.StatementAdapter.evaluate(StatementAdapter.java:36) at
org.apache.lucene.util.TestRuleStoreClassName$1.evaluate(TestRuleStoreClassName.java:42) at
com.carrotsearch.randomizedtesting.rules.NoShadowingOrOverridesOnMethodsRule$1.evaluate(NoShadowingOrOverridesOnMethodsRule.java:39) at
com.carrotsearch.randomizedtesting.rules.NoShadowingOrOverridesOnMethodsRule$1.evaluate(NoShadowingOrOverridesOnMethodsRule.java:39) at
com.carrotsearch.randomizedtesting.rules.StatementAdapter.evaluate(StatementAdapter.java:36) at
com.carrotsearch.randomizedtesting.rules.StatementAdapter.evaluate(StatementAdapter.java:36) at
com.carrotsearch.randomizedtesting.rules.StatementAdapter.evaluate(StatementAdapter.java:36) at
org.apache.lucene.util.TestRuleAssertionsRequired$1.evaluate(TestRuleAssertionsRequired.java:54) at
org.apache.lucene.util.TestRuleMarkFailure$1.evaluate(TestRuleMarkFailure.java:48) at
org.apache.lucene.util.TestRuleIgnoreAfterMaxFailures$1.evaluate(TestRuleIgnoreAfterMaxFailures.java:65) at
org.apache.lucene.util.TestRuleIgnoreTestSuites$1.evaluate(TestRuleIgnoreTestSuites.java:55) at
com.carrotsearch.randomizedtesting.rules.StatementAdapter.evaluate(StatementAdapter.java:36) at
com.carrotsearch.randomizedtesting.ThreadLeakControl$StatementRunner.run(ThreadLeakControl.java:365) at java.lang.Thread.run(Thread.java:745)

FAILED:
org.apache.lucene.index.TestIndexWriterNRTIsCurrent.testIsCurrentWithThreads

Error Message:

Stack Trace: java.lang.AssertionError at
__randomizedtesting.SeedInfo.seed([721798422A6325A1:46610355A1C8437E]:0) at org.junit.Assert.fail(Assert.java:92) at org.junit.Assert.assertTrue(Assert.java:43) at org.junit.Assert.assertFalse(Assert.java:68) at org.junit.Assert.assertFalse(Assert.java:79) at
org.apache.lucene.index.TestIndexWriterNRTIsCurrent.testIsCurrentWithThreads(TestIndexWriterNRTIsCurrent.java:65) at sun.reflect.NativeMethodAccessorImpl.invoke0(Native Method) at
sun.reflect.NativeMethodAccessorImpl.invoke(NativeMethodAccessorImpl.java:62) at
sun.reflect.DelegatingMethodAccessorImpl.invoke(DelegatingMethodAccessorImpl.java:43) at java.lang.reflect.Method.invoke(Method.java:502) at
com.carrotsearch.randomizedtesting.RandomizedRunner.invoke(RandomizedRunner.java:1627) at
com.carrotsearch.randomizedtesting.RandomizedRunner$6.evaluate(RandomizedRunner.java:836) at
com.carrotsearch.randomizedtesting.RandomizedRunner$7.evaluate(RandomizedRunner.java:872) at
com.carrotsearch.randomizedtesting.RandomizedRunner$8.evaluate(RandomizedRunner.java:886) at
org.apache.lucene.util.TestRuleSetupTeardownChained$1.evaluate(TestRuleSetupTeardownChained.java:50) at
org.apache.lucene.util.AbstractBeforeAfterRule$1.evaluate(AbstractBeforeAfterRule.java:46) at
org.apache.lucene.util.TestRuleThreadAndTestName$1.evaluate(TestRuleThreadAndTestName.java:49) at
org.apache.lucene.util.TestRuleIgnoreAfterMaxFailures$1.evaluate(TestRuleIgnoreAfterMaxFailures.java:65) at
org.apache.lucene.util.TestRuleMarkFailure$1.evaluate(TestRuleMarkFailure.java:48) at
com.carrotsearch.randomizedtesting.rules.StatementAdapter.evaluate(StatementAdapter.java:36) at
com.carrotsearch.randomizedtesting.ThreadLeakControl$StatementRunner.run(ThreadLeakControl.java:365) at
com.carrotsearch.randomizedtesting.ThreadLeakControl.forkTimeoutingTask(ThreadLeakControl.java:798) at
com.carrotsearch.randomizedtesting.ThreadLeakControl$3.evaluate(ThreadLeakControl.java:458) at
com.carrotsearch.randomizedtesting.RandomizedRunner.runSingleTest(RandomizedRunner.java:845) at
com.carrotsearch.randomizedtesting.RandomizedRunner$3.evaluate(RandomizedRunner.java:747) at
com.carrotsearch.randomizedtesting.RandomizedRunner$4.evaluate(RandomizedRunner.java:781) at
com.carrotsearch.randomizedtesting.RandomizedRunner$5.evaluate(RandomizedRunner.java:792) at
org.apache.lucene.util.AbstractBeforeAfterRule$1.evaluate(AbstractBeforeAfterRule.java:46) at
com.carrotsearch.randomizedtesting.rules.StatementAdapter.evaluate(StatementAdapter.java:36) at
org.apache.lucene.util.TestRuleStoreClassName$1.evaluate(TestRuleStoreClassName.java:42) at
com.carrotsearch.randomizedtesting.rules.NoShadowingOrOverridesOnMethodsRule$1.evaluate(NoShadowingOrOverridesOnMethodsRule.java:39) at
com.carrotsearch.randomizedtesting.rules.NoShadowingOrOverridesOnMethodsRule$1.evaluate(NoShadowingOrOverridesOnMethodsRule.java:39) at
com.carrotsearch.randomizedtesting.rules.StatementAdapter.evaluate(StatementAdapter.java:36) at
com.carrotsearch.randomizedtesting.rules.StatementAdapter.evaluate(StatementAdapter.java:36) at
com.carrotsearch.randomizedtesting.rules.StatementAdapter.evaluate(StatementAdapter.java:36) at
org.apache.lucene.util.TestRuleAssertionsRequired$1.evaluate(TestRuleAssertionsRequired.java:54) at
org.apache.lucene.util.TestRuleMarkFailure$1.evaluate(TestRuleMarkFailure.java:48) at
org.apache.lucene.util.TestRuleIgnoreAfterMaxFailures$1.evaluate(TestRuleIgnoreAfterMaxFailures.java:65) at org.apache.lu

[...truncated too long message...]

a:1458) [junit4] > at
org.apache.lucene.index.IndexWriter.addDocument(IndexWriter.java:1237) [junit4] > at
org.apache.lucene.index.RandomIndexWriter.addDocument(RandomIndexWriter.java:173) [junit4] > at
org.apache.lucene.index.TestAllFilesHaveChecksumFooter.test(TestAllFilesHaveChecksumFooter.java:52) [junit4] > at java.lang.Thread.run(Thread.java:745) [junit4] > Suppressed: java.lang.IllegalStateException: close()
called in wrong state: RESET [junit4] > at
org.apache.lucene.analysis.MockTokenizer.fail(MockTokenizer.java:126) [junit4] > at
org.apache.lucene.analysis.MockTokenizer.close(MockTokenizer.java:293) [junit4] > at
org.apache.lucene.analysis.TokenFilter.close(TokenFilter.java:58) [junit4] > at
org.apache.lucene.index.DefaultIndexingChain$PerField.invert(DefaultIndexingChain.java:675) [junit4] > ... 43 more [junit4] 2> NOTE: test params are: codec=Asserting(Lucene53): {},
docValues:{}, sim=RandomSimilarityProvider(queryNorm=false,coord=no): {body=DFR
I(ne)B2}, locale=hr, timezone=Africa/Kampala [junit4] 2> NOTE: Linux 3.16.0-41-generic i386/Oracle Corporation 1.9.0-ea
(32-bit)/cpus=12,threads=1,free=18904632,total=401866752 [junit4] 2> NOTE: All tests run in this JVM: [TestDocIdSet, TestIntsRef,
Test2BPagedBytes, TestIndexCommit, TestTimeLimitingCollector, TestIndexInput,
TestMultiLevelSkipList, TestInPlaceMergeSorter, TestMinimize,
TestIndexWriterOutOfMemory, TestEarlyTermination, TestLongBitSet,
TestRegexpQuery, TestParallelCompositeReader, TestSumDocFreq,
TestDeterminizeLexicon, TestIndexWriterOnDiskFull, TestPayloadBasics,
Test2BPositions, TestPhraseQuery, TestRoaringDocIdSet, TestHugeRamFile,
TestIndexWriterUnicode, TestMergeRateLimiter, TestParallelReaderEmptyIndex,
TestMultiDocValues, TestForTooMuchCloning, TestLockFactory, TestPrefixQuery,
TestDocsAndPositions, TestPerFieldPostingsFormat, TestSearcherManager,
TestIndexWriterDeleteByQuery, TestCharTermAttributeImpl,
TestLucene50CompoundFormat, TestExitableDirectoryReader, TestDocValuesIndexing,
TestOfflineSorter, TestIndexWriterFromReader, TestSpanTermQuery,
TestNumericRangeQuery64, TestSubScorerFreqs, TestMultiFields, TestSpansAdvanced,
TestSortRandom, TestIndexSearcher, TestApproximationSearchEquivalence,
TestBinaryDocValuesUpdates, Test2BBinaryDocValues, TestTermsEnum, TestFieldType,
TestIndexWriterCommit, TestMixedDocValuesUpdates, TestNoMergeScheduler,
TestFileSwitchDirectory, TestIndexWriterDelete, TestCrash,
TestCodecHoldsOpenFiles, TestConjunctions, TestPrefixCodedTerms, TestSetOnce,
TestPagedBytes, TestMutableValues, TestNearSpansOrdered, TestNIOFSDirectory,
TestFixedBitSet, TestTransactionRollback, TestIndexWriterWithThreads,
TestNumericRangeQuery32, TestNRTThreads, TestSearchWithThreads, TestNeverDelete,
TestSnapshotDeletionPolicy, TestTieredMergePolicy, TestByteSlices,
TestCollectionUtil, TestIndexWriterNRTIsCurrent, TestFieldCacheRewriteMethod,
TestToken, TestFieldsReader, TestCustomSearcherSort, TestNumericUtils,
TestTermVectorsWriter, TestPayloadExplanations, TestThreadedForceMerge,
TestSloppyPhraseQuery2, TestDisjunctionMaxQuery, TestOmitTf,
TestPayloadNearQuery, TestScorerPerf, Test2BNumericDocValues,
TestBlockPostingsFormat, Test2BSortedDocValuesOrds,
TestAllFilesHaveChecksumFooter] [junit4] Completed [336/398] on J0 in 0.03s, 1 test, 1 error <<< FAILURES!

[...truncated 123 lines...] [junit4] Suite: org.apache.lucene.search.payloads.TestPayloadSpans [junit4] 2> NOTE: reproduce with: ant test -Dtestcase=TestPayloadSpans
-Dtests.method=testSpanNot -Dtests.seed=721798422A6325A1 -Dtests.multiplier=3
-Dtests.slow=true -Dtests.locale=de -Dtests.timezone=Africa/Asmera
-Dtests.asserts=true -Dtests.file.encoding=UTF-8 [junit4] FAILURE 0.09s J0 | TestPayloadSpans.testSpanNot <<< [junit4] > Throwable #1: java.lang.AssertionError: expected numSpans
expected:<1> but was:<0> [junit4] > at
__randomizedtesting.SeedInfo.seed([721798422A6325A1:DF692E48EB213602]:0) [junit4] > at
org.apache.lucene.search.payloads.TestPayloadSpans.checkSpans(TestPayloadSpans.java:486) [junit4] > at
org.apache.lucene.search.payloads.TestPayloadSpans.testSpanNot(TestPayloadSpans.java:131) [junit4] > at java.lang.Thread.run(Thread.java:745) [junit4] 2> NOTE: reproduce with: ant test -Dtestcase=TestPayloadSpans
-Dtests.method=testFirstClauseWithoutPayload -Dtests.seed=721798422A6325A1
-Dtests.multiplier=3 -Dtests.slow=true -Dtests.locale=de
-Dtests.timezone=Africa/Asmera -Dtests.asserts=true -Dtests.file.encoding=UTF-8 [junit4] FAILURE 0.08s J0 | TestPayloadSpans.testFirstClauseWithoutPayload
<<< [junit4] > Throwable #1: java.lang.AssertionError: spans is null and it
shouldn't be [junit4] > at
__randomizedtesting.SeedInfo.seed([721798422A6325A1:69342FA5DFB29B7A]:0) [junit4] > at
org.apache.lucene.search.payloads.TestPayloadSpans.testFirstClauseWithoutPayload(TestPayloadSpans.java:219) [junit4] > at java.lang.Thread.run(Thread.java:745) [junit4] 2> NOTE: reproduce with: ant test -Dtestcase=TestPayloadSpans
-Dtests.method=testSpanFirst -Dtests.seed=721798422A6325A1 -Dtests.multiplier=3
-Dtests.slow=true -Dtests.locale=de -Dtests.timezone=Africa/Asmera
-Dtests.asserts=true -Dtests.file.encoding=UTF-8 [junit4] FAILURE 0.05s J0 | TestPayloadSpans.testSpanFirst <<< [junit4] > Throwable #1: java.lang.AssertionError: expectedNumSpans
expected:<109> but was:<72> [junit4] > at
__randomizedtesting.SeedInfo.seed([721798422A6325A1:40A6AF02AFB72DA2]:0) [junit4] > at
org.apache.lucene.search.payloads.TestPayloadSpans.checkSpans(TestPayloadSpans.java:438) [junit4] > at
org.apache.lucene.search.payloads.TestPayloadSpans.testSpanFirst(TestPayloadSpans.java:96) [junit4] > at java.lang.Thread.run(Thread.java:745) [junit4] 2> NOTE: test params are: codec=Asserting(Lucene53):
{noPayloadField=PostingsFormat(name=Memory doPackFST= false),
field=PostingsFormat(name=LuceneVarGapDocFreqInterval),
multiField=PostingsFormat(name=Memory doPackFST= false),
content=PostingsFormat(name=Memory doPackFST= false)}, docValues:{},
sim=RandomSimilarityProvider(queryNorm=true,coord=no): {content=DFR I(F)Z(0.3)},
locale=de, timezone=Africa/Asmera [junit4] 2> NOTE: Linux 3.16.0-41-generic i386/Oracle Corporation 1.9.0-ea
(32-bit)/cpus=12,threads=1,free=187392024,total=312999936 [junit4] 2> NOTE: All tests run in this JVM: [TestDocIdSet, TestIntsRef,
Test2BPagedBytes, TestIndexCommit, TestTimeLimitingCollector, TestIndexInput,
TestMultiLevelSkipList, TestInPlaceMergeSorter, TestMinimize,
TestIndexWriterOutOfMemory, TestEarlyTermination, TestLongBitSet,
TestRegexpQuery, TestParallelCompositeReader, TestSumDocFreq,
TestDeterminizeLexicon, TestIndexWriterOnDiskFull, TestPayloadBasics,
Test2BPositions, TestPhraseQuery, TestRoaringDocIdSet, TestHugeRamFile,
TestIndexWriterUnicode, TestMergeRateLimiter, TestParallelReaderEmptyIndex,
TestMultiDocValues, TestForTooMuchCloning, TestLockFactory, TestPrefixQuery,
TestDocsAndPositions, TestPerFieldPostingsFormat, TestSearcherManager,
TestIndexWriterDeleteByQuery, TestCharTermAttributeImpl,
TestLucene50CompoundFormat, TestExitableDirectoryReader, TestDocValuesIndexing,
TestOfflineSorter, TestIndexWriterFromReader, TestSpanTermQuery,
TestNumericRangeQuery64, TestSubScorerFreqs, TestMultiFields, TestSpansAdvanced,
TestSortRandom, TestIndexSearcher, TestApproximationSearchEquivalence,
TestBinaryDocValuesUpdates, Test2BBinaryDocValues, TestTermsEnum, TestFieldType,
TestIndexWriterCommit, TestMixedDocValuesUpdates, TestNoMergeScheduler,
TestFileSwitchDirectory, TestIndexWriterDelete, TestCrash,
TestCodecHoldsOpenFiles, TestConjunctions, TestPrefixCodedTerms, TestSetOnce,
TestPagedBytes, TestMutableValues, TestNearSpansOrdered, TestNIOFSDirectory,
TestFixedBitSet, TestTransactionRollback, TestIndexWriterWithThreads,
TestNumericRangeQuery32, TestNRTThreads, TestSearchWithThreads, TestNeverDelete,
TestSnapshotDeletionPolicy, TestTieredMergePolicy, TestByteSlices,
TestCollectionUtil, TestIndexWriterNRTIsCurrent, TestFieldCacheRewriteMethod,
TestToken, TestFieldsReader, TestCustomSearcherSort, TestNumericUtils,
TestTermVectorsWriter, TestPayloadExplanations, TestThreadedForceMerge,
TestSloppyPhraseQuery2, TestDisjunctionMaxQuery, TestOmitTf,
TestPayloadNearQuery, TestScorerPerf, Test2BNumericDocValues,
TestBlockPostingsFormat, Test2BSortedDocValuesOrds,
TestAllFilesHaveChecksumFooter, TestCodecUtil, TestDemoParallelLeafReader,
TestIndexWriterMaxDocs, TestIndexWriterOutOfFileDescriptors,
TestControlledRealTimeReopenThread, TestFilterCachingPolicy,
TestMatchNoDocsQuery, TestMinShouldMatch2, TestPayloadSpans] [junit4] Completed [373/398] on J0 in 0.57s, 10 tests, 3 failures <<<
FAILURES!

[...truncated 103 lines...] BUILD FAILED /home/jenkins/workspace/Lucene-Solr-trunk-Linux/build.xml:526: The following
error occurred while executing this line: /home/jenkins/workspace/Lucene-Solr-trunk-Linux/build.xml:474: The following
error occurred while executing this line: /home/jenkins/workspace/Lucene-Solr-trunk-Linux/build.xml:61: The following
error occurred while executing this line: /home/jenkins/workspace/Lucene-Solr-trunk-Linux/extra-targets.xml:39: The
following error occurred while executing this line: /home/jenkins/workspace/Lucene-Solr-trunk-Linux/lucene/build.xml:50: The
following error occurred while executing this line: /home/jenkins/workspace/Lucene-Solr-trunk-Linux/lucene/common-build.xml:1426:
The following error occurred while executing this line: /home/jenkins/workspace/Lucene-Solr-trunk-Linux/lucene/common-build.xml:981:
There were test failures: 398 suites, 3200 tests, 1 suite-level error, 9 errors,
176 failures, 51 ignored (47 assumptions)

Total time: 5 minutes 38 seconds Build step 'Invoke Ant' marked build as failure Archiving artifacts Recording test results Email was triggered for: Failure - Any Sending email for trigger: Failure - Any